hadoop-hdfs-dev mailing list archives

Site index · List index
Message view « Date » · « Thread »
Top « Date » · « Thread »
From Apache Jenkins Server <jenk...@builds.apache.org>
Subject Hadoop-Hdfs-0.23-Build - Build # 45 - Still Unstable
Date Thu, 20 Oct 2011 12:46:55 GMT
See https://builds.apache.org/job/Hadoop-Hdfs-0.23-Build/45/

###################################################################################
########################## LAST 60 LINES OF THE CONSOLE ###########################
[...truncated 9813 lines...]
[INFO] 
[INFO] There are 9015 checkstyle errors.
[WARNING] Unable to locate Source XRef to link to - DISABLED
[INFO] 
[INFO] --- findbugs-maven-plugin:2.3.2:findbugs (default-cli) @ hadoop-hdfs ---
[INFO] ****** FindBugsMojo execute *******
[INFO] canGenerate is true
[INFO] ****** FindBugsMojo executeFindbugs *******
[INFO] Temp File is /home/jenkins/jenkins-slave/workspace/Hadoop-Hdfs-0.23-Build/trunk/hadoop-hdfs-project/hadoop-hdfs/target/findbugsTemp.xml
[INFO] Fork Value is true
[INFO] xmlOutput is false
[INFO]                                                                         
[INFO] ------------------------------------------------------------------------
[INFO] Building Apache Hadoop HDFS Project 0.23.0-SNAPSHOT
[INFO] ------------------------------------------------------------------------
[INFO] 
[INFO] --- maven-clean-plugin:2.4.1:clean (default-clean) @ hadoop-hdfs-project ---
[INFO] 
[INFO] --- maven-checkstyle-plugin:2.6:checkstyle (default-cli) @ hadoop-hdfs-project ---
[INFO] 
[INFO] --- findbugs-maven-plugin:2.3.2:findbugs (default-cli) @ hadoop-hdfs-project ---
[INFO] ****** FindBugsMojo execute *******
[INFO] canGenerate is false
[INFO] ------------------------------------------------------------------------
[INFO] Reactor Summary:
[INFO] 
[INFO] Apache Hadoop HDFS ................................ SUCCESS [3:28.756s]
[INFO] Apache Hadoop HDFS Project ........................ SUCCESS [0.059s]
[INFO] ------------------------------------------------------------------------
[INFO] BUILD SUCCESS
[INFO] ------------------------------------------------------------------------
[INFO] Total time: 3:29.255s
[INFO] Finished at: Thu Oct 20 11:37:16 UTC 2011
[INFO] Final Memory: 58M/761M
[INFO] ------------------------------------------------------------------------
+ /home/jenkins/tools/maven/latest/bin/mvn test -Dmaven.test.failure.ignore=true -Pclover
-DcloverLicenseLocation=/home/jenkins/tools/clover/latest/lib/clover.license
Archiving artifacts
Publishing Clover coverage report...
Publishing Clover HTML report...
Publishing Clover XML report...
Publishing Clover coverage results...
Recording test results
Build step 'Publish JUnit test result report' changed build result to UNSTABLE
Publishing Javadoc
Recording fingerprints
Updating HADOOP-7744
Updating HDFS-2445
Updating MAPREDUCE-2788
Updating MAPREDUCE-3208
Updating MAPREDUCE-3181
Updating MAPREDUCE-3212
Updating HDFS-2471
Updating MAPREDUCE-2693
Updating MAPREDUCE-3176
Updating MAPREDUCE-3179
Updating MAPREDUCE-3188
Sending e-mails to: hdfs-dev@hadoop.apache.org
Email was triggered for: Unstable
Sending email for trigger: Unstable



###################################################################################
############################## FAILED TESTS (if any) ##############################
1 tests failed.
FAILED:  org.apache.hadoop.hdfs.TestDfsOverAvroRpc.testWorkingDirectory

Error Message:
Two methods with same name: delete

Stack Trace:
org.apache.avro.AvroTypeException: Two methods with same name: delete
	at org.apache.avro.reflect.ReflectData.getProtocol(ReflectData.java:394)
	at org.apache.avro.ipc.reflect.ReflectResponder.<init>(ReflectResponder.java:36)
	at org.apache.hadoop.ipc.AvroRpcEngine.createResponder(AvroRpcEngine.java:189)
	at org.apache.hadoop.ipc.AvroRpcEngine$TunnelResponder.<init>(AvroRpcEngine.java:196)
	at org.apache.hadoop.ipc.AvroRpcEngine.getServer(AvroRpcEngine.java:232)
	at org.apache.hadoop.ipc.RPC.getServer(RPC.java:550)
	at org.apache.hadoop.hdfs.server.namenode.NameNodeRpcServer.<init>(NameNodeRpcServer.java:144)
	at org.apache.hadoop.hdfs.server.namenode.NameNode.createRpcServer(NameNode.java:350)
	at org.apache.hadoop.hdfs.server.namenode.NameNode.initialize(NameNode.java:328)
	at org.apache.hadoop.hdfs.server.namenode.NameNode.<init>(NameNode.java:452)
	at org.apache.hadoop.hdfs.server.namenode.NameNode.<init>(NameNode.java:444)
	at org.apache.hadoop.hdfs.server.namenode.NameNode.createNameNode(NameNode.java:742)
	at org.apache.hadoop.hdfs.MiniDFSCluster.createNameNode(MiniDFSCluster.java:641)
	at org.apache.hadoop.hdfs.MiniDFSCluster.initMiniDFSCluster(MiniDFSCluster.java:545)
	at org.apache.hadoop.hdfs.MiniDFSCluster.<init>(MiniDFSCluster.java:261)
	at org.apache.hadoop.hdfs.MiniDFSCluster.<init>(MiniDFSCluster.java:85)
	at org.apache.hadoop.hdfs.MiniDFSCluster$Builder.build(MiniDFSCluster.java:247)
	at org.apache.hadoop.hdfs.TestLocalDFS.__CLR3_0_2hl5jzp16fz(TestLocalDFS.java:64)
	at org.apache.hadoop.hdfs.TestLocalDFS.testWorkingDirectory(TestLocalDFS.java:62)
	at org.apache.hadoop.hdfs.TestDfsOverAvroRpc.__CLR3_0_2hl5jzp13n0(TestDfsOverAvroRpc.java:30)
	at org.apache.hadoop.hdfs.TestDfsOverAvroRpc.testWorkingDirectory(TestDfsOverAvroRpc.java:27)
	at sun.reflect.NativeMethodAccessorImpl.invoke0(Native Method)
	at sun.reflect.NativeMethodAccessorImpl.invoke(NativeMethodAccessorImpl.java:39)
	at sun.reflect.DelegatingMethodAccessorImpl.invoke(DelegatingMethodAccessorImpl.java:25)
	at java.lang.reflect.Method.invoke(Method.java:597)
	at junit.framework.TestCase.runTest(TestCase.java:168)
	at junit.framework.TestCase.runBare(TestCase.java:134)
	at junit.framework.TestResult$1.protect(TestResult.java:110)
	at junit.framework.TestResult.runProtected(TestResult.java:128)
	at junit.framework.TestResult.run(TestResult.java:113)
	at junit.framework.TestCase.run(TestCase.java:124)
	at junit.framework.TestSuite.runTest(TestSuite.java:232)
	at junit.framework.TestSuite.run(TestSuite.java:227)
	at org.junit.internal.runners.JUnit38ClassRunner.run(JUnit38ClassRunner.java:83)
	at org.apache.maven.surefire.junit4.JUnit4TestSet.execute(JUnit4TestSet.java:53)
	at org.apache.maven.surefire.junit4.JUnit4Provider.executeTestSet(JUnit4Provider.java:123)
	at org.apache.maven.surefire.junit4.JUnit4Provider.invoke(JUnit4Provider.java:104)
	at sun.reflect.NativeMethodAccessorImpl.invoke0(Native Method)
	at sun.reflect.NativeMethodAccessorImpl.invoke(NativeMethodAccessorImpl.java:39)
	at sun.reflect.DelegatingMethodAccessorImpl.invoke(DelegatingMethodAccessorImpl.java:25)
	at java.lang.reflect.Method.invoke(Method.java:597)
	at org.apache.maven.surefire.util.ReflectionUtils.invokeMethodWithArray(ReflectionUtils.java:164)
	at org.apache.maven.surefire.booter.ProviderFactory$ProviderProxy.invoke(ProviderFactory.java:110)
	at org.apache.maven.surefire.booter.SurefireStarter.invokeProvider(SurefireStarter.java:172)
	at org.apache.maven.surefire.booter.SurefireStarter.runSuitesInProcessWhenForked(SurefireStarter.java:78)
	at org.apache.maven.surefire.booter.ForkedBooter.main(ForkedBooter.java:70)




Mime
View raw message