hadoop-hdfs-dev mailing list archives

Site index · List index
Message view « Date » · « Thread »
Top « Date » · « Thread »
From Apache Jenkins Server <jenk...@builds.apache.org>
Subject Hadoop-Hdfs-0.23-Build - Build # 27 - Failure
Date Sun, 02 Oct 2011 12:44:17 GMT
See https://builds.apache.org/job/Hadoop-Hdfs-0.23-Build/27/

###################################################################################
########################## LAST 60 LINES OF THE CONSOLE ###########################
[...truncated 7142 lines...]
[INFO] Executed tasks
[INFO] 
[INFO] --- maven-antrun-plugin:1.6:run (compile) @ hadoop-hdfs ---
[INFO] Executing tasks

main:
     [copy] Copying 15 files to /home/jenkins/jenkins-slave/workspace/Hadoop-Hdfs-0.23-Build/trunk/hadoop-hdfs-project/hadoop-hdfs/target/native
     [copy] Copied 6 empty directories to 2 empty directories under /home/jenkins/jenkins-slave/workspace/Hadoop-Hdfs-0.23-Build/trunk/hadoop-hdfs-project/hadoop-hdfs/target/native
[INFO] Executed tasks
[INFO] 
[INFO] --- make-maven-plugin:1.0-beta-1:autoreconf (compile) @ hadoop-hdfs ---
[INFO] ------------------------------------------------------------------------
[INFO] Reactor Summary:
[INFO] 
[INFO] Apache Hadoop HDFS ................................ FAILURE [11.118s]
[INFO] Apache Hadoop HDFS Project ........................ SKIPPED
[INFO] ------------------------------------------------------------------------
[INFO] BUILD FAILURE
[INFO] ------------------------------------------------------------------------
[INFO] Total time: 11.568s
[INFO] Finished at: Sun Oct 02 11:34:22 UTC 2011
[INFO] Final Memory: 24M/257M
[INFO] ------------------------------------------------------------------------
[ERROR] Failed to execute goal org.codehaus.mojo:make-maven-plugin:1.0-beta-1:autoreconf (compile)
on project hadoop-hdfs: autoreconf command returned an exit value != 0. Aborting build; see
debug output for more information. -> [Help 1]
[ERROR] 
[ERROR] To see the full stack trace of the errors, re-run Maven with the -e switch.
[ERROR] Re-run Maven using the -X switch to enable full debug logging.
[ERROR] 
[ERROR] For more information about the errors and possible solutions, please read the following
articles:
[ERROR] [Help 1] http://cwiki.apache.org/confluence/display/MAVEN/MojoExecutionException
+ /home/jenkins/tools/maven/latest/bin/mvn test -Dmaven.test.failure.ignore=true -Pclover
-DcloverLicenseLocation=/home/jenkins/tools/clover/latest/lib/clover.license
Archiving artifacts
Publishing Clover coverage report...
Publishing Clover HTML report...
Publishing Clover XML report...
Publishing Clover coverage results...
Recording test results
Build step 'Publish JUnit test result report' changed build result to UNSTABLE
Publishing Javadoc
ERROR: Publisher hudson.tasks.JavadocArchiver aborted due to exception
/home/jenkins/jenkins-slave/workspace/Hadoop-Hdfs-0.23-Build/trunk/hadoop-hdfs-project/hadoop-hdfs/target/site/api
does not exist.
	at org.apache.tools.ant.types.AbstractFileSet.getDirectoryScanner(AbstractFileSet.java:474)
	at hudson.FilePath$34.hasMatch(FilePath.java:1801)
	at hudson.FilePath$34.invoke(FilePath.java:1710)
	at hudson.FilePath$34.invoke(FilePath.java:1701)
	at hudson.FilePath$FileCallableWrapper.call(FilePath.java:1995)
	at hudson.remoting.UserRequest.perform(UserRequest.java:118)
	at hudson.remoting.UserRequest.perform(UserRequest.java:48)
	at hudson.remoting.Request$2.run(Request.java:287)
	at java.util.concurrent.Executors$RunnableAdapter.call(Executors.java:441)
	at java.util.concurrent.FutureTask$Sync.innerRun(FutureTask.java:303)
	at java.util.concurrent.FutureTask.run(FutureTask.java:138)
	at java.util.concurrent.ThreadPoolExecutor$Worker.runTask(ThreadPoolExecutor.java:886)
	at java.util.concurrent.ThreadPoolExecutor$Worker.run(ThreadPoolExecutor.java:908)
	at java.lang.Thread.run(Thread.java:662)
Recording fingerprints
Sending e-mails to: hdfs-dev@hadoop.apache.org
Email was triggered for: Failure
Sending email for trigger: Failure



###################################################################################
############################## FAILED TESTS (if any) ##############################
4 tests failed.
REGRESSION:  org.apache.hadoop.hdfs.TestDFSRollback.testRollback

Error Message:
File contents differed:   /home/jenkins/jenkins-slave/workspace/Hadoop-Hdfs-0.23-Build/trunk/hadoop-hdfs-project/hadoop-hdfs/target/test/data/dfs/data2/current/VERSION=3ad36fd79e86e5e235482077dd811f07
  /home/jenkins/jenkins-slave/workspace/Hadoop-Hdfs-0.23-Build/trunk/hadoop-hdfs-project/hadoop-hdfs/target/test/data/dfs/data1/current/VERSION=816adeea1f64a97f27ff518803dbd8f0

Stack Trace:
java.lang.AssertionError: File contents differed:
  /home/jenkins/jenkins-slave/workspace/Hadoop-Hdfs-0.23-Build/trunk/hadoop-hdfs-project/hadoop-hdfs/target/test/data/dfs/data2/current/VERSION=3ad36fd79e86e5e235482077dd811f07
  /home/jenkins/jenkins-slave/workspace/Hadoop-Hdfs-0.23-Build/trunk/hadoop-hdfs-project/hadoop-hdfs/target/test/data/dfs/data1/current/VERSION=816adeea1f64a97f27ff518803dbd8f0
	at org.junit.Assert.fail(Assert.java:91)
	at org.apache.hadoop.hdfs.server.namenode.FSImageTestUtil.assertFileContentsSame(FSImageTestUtil.java:250)
	at org.apache.hadoop.hdfs.server.namenode.FSImageTestUtil.assertParallelFilesAreIdentical(FSImageTestUtil.java:236)
	at org.apache.hadoop.hdfs.TestDFSRollback.checkResult(TestDFSRollback.java:86)
	at org.apache.hadoop.hdfs.TestDFSRollback.__CLR3_0_27oj5yb11bd(TestDFSRollback.java:171)
	at org.apache.hadoop.hdfs.TestDFSRollback.testRollback(TestDFSRollback.java:134)
	at sun.reflect.NativeMethodAccessorImpl.invoke0(Native Method)
	at sun.reflect.NativeMethodAccessorImpl.invoke(NativeMethodAccessorImpl.java:39)
	at sun.reflect.DelegatingMethodAccessorImpl.invoke(DelegatingMethodAccessorImpl.java:25)
	at java.lang.reflect.Method.invoke(Method.java:597)
	at junit.framework.TestCase.runTest(TestCase.java:168)
	at junit.framework.TestCase.runBare(TestCase.java:134)
	at junit.framework.TestResult$1.protect(TestResult.java:110)
	at junit.framework.TestResult.runProtected(TestResult.java:128)
	at junit.framework.TestResult.run(TestResult.java:113)
	at junit.framework.TestCase.run(TestCase.java:124)
	at junit.framework.TestSuite.runTest(TestSuite.java:232)
	at junit.framework.TestSuite.run(TestSuite.java:227)
	at org.junit.internal.runners.JUnit38ClassRunner.run(JUnit38ClassRunner.java:83)
	at org.apache.maven.surefire.junit4.JUnit4TestSet.execute(JUnit4TestSet.java:59)
	at org.apache.maven.surefire.suite.AbstractDirectoryTestSuite.executeTestSet(AbstractDirectoryTestSuite.java:120)
	at org.apache.maven.surefire.suite.AbstractDirectoryTestSuite.execute(AbstractDirectoryTestSuite.java:145)
	at org.apache.maven.surefire.Surefire.run(Surefire.java:104)
	at sun.reflect.NativeMethodAccessorImpl.invoke0(Native Method)
	at sun.reflect.NativeMethodAccessorImpl.invoke(NativeMethodAccessorImpl.java:39)
	at sun.reflect.DelegatingMethodAccessorImpl.invoke(DelegatingMethodAccessorImpl.java:25)
	at java.lang.reflect.Method.invoke(Method.java:597)
	at org.apache.maven.surefire.booter.SurefireBooter.runSuitesInProcess(SurefireBooter.java:290)
	at org.apache.maven.surefire.booter.SurefireBooter.main(SurefireBooter.java:1017)


REGRESSION:  org.apache.hadoop.hdfs.server.balancer.TestBalancerWithMultipleNameNodes.testBalancer

Error Message:
expected:<1> but was:<-2>

Stack Trace:
java.lang.AssertionError: expected:<1> but was:<-2>
	at org.junit.Assert.fail(Assert.java:91)
	at org.junit.Assert.failNotEquals(Assert.java:645)
	at org.junit.Assert.assertEquals(Assert.java:126)
	at org.junit.Assert.assertEquals(Assert.java:470)
	at org.junit.Assert.assertEquals(Assert.java:454)
	at org.apache.hadoop.hdfs.server.balancer.TestBalancerWithMultipleNameNodes.runBalancer(TestBalancerWithMultipleNameNodes.java:163)
	at org.apache.hadoop.hdfs.server.balancer.TestBalancerWithMultipleNameNodes.runTest(TestBalancerWithMultipleNameNodes.java:361)
	at org.apache.hadoop.hdfs.server.balancer.TestBalancerWithMultipleNameNodes.__CLR3_0_27qjdv51937(TestBalancerWithMultipleNameNodes.java:375)
	at org.apache.hadoop.hdfs.server.balancer.TestBalancerWithMultipleNameNodes.testBalancer(TestBalancerWithMultipleNameNodes.java:373)
	at sun.reflect.NativeMethodAccessorImpl.invoke0(Native Method)
	at sun.reflect.NativeMethodAccessorImpl.invoke(NativeMethodAccessorImpl.java:39)
	at sun.reflect.DelegatingMethodAccessorImpl.invoke(DelegatingMethodAccessorImpl.java:25)
	at java.lang.reflect.Method.invoke(Method.java:597)
	at org.junit.runners.model.FrameworkMethod$1.runReflectiveCall(FrameworkMethod.java:44)
	at org.junit.internal.runners.model.ReflectiveCallable.run(ReflectiveCallable.java:15)
	at org.junit.runners.model.FrameworkMethod.invokeExplosively(FrameworkMethod.java:41)
	at org.junit.internal.runners.statements.InvokeMethod.evaluate(InvokeMethod.java:20)
	at org.junit.runners.BlockJUnit4ClassRunner.runChild(BlockJUnit4ClassRunner.java:76)
	at org.junit.runners.BlockJUnit4ClassRunner.runChild(BlockJUnit4ClassRunner.java:50)
	at org.junit.runners.ParentRunner$3.run(ParentRunner.java:193)
	at org.junit.runners.ParentRunner$1.schedule(ParentRunner.java:52)
	at org.junit.runners.ParentRunner.runChildren(ParentRunner.java:191)
	at org.junit.runners.ParentRunner.access$000(ParentRunner.java:42)
	at org.junit.runners.ParentRunner$2.evaluate(ParentRunner.java:184)
	at org.junit.runners.ParentRunner.run(ParentRunner.java:236)
	at org.apache.maven.surefire.junit4.JUnit4TestSet.execute(JUnit4TestSet.java:59)
	at org.apache.maven.surefire.suite.AbstractDirectoryTestSuite.executeTestSet(AbstractDirectoryTestSuite.java:120)
	at org.apache.maven.surefire.suite.AbstractDirectoryTestSuite.execute(AbstractDirectoryTestSuite.java:145)
	at org.apache.maven.surefire.Surefire.run(Surefire.java:104)
	at sun.reflect.NativeMethodAccessorImpl.invoke0(Native Method)
	at sun.reflect.NativeMethodAccessorImpl.invoke(NativeMethodAccessorImpl.java:39)
	at sun.reflect.DelegatingMethodAccessorImpl.invoke(DelegatingMethodAccessorImpl.java:25)
	at java.lang.reflect.Method.invoke(Method.java:597)
	at org.apache.maven.surefire.booter.SurefireBooter.runSuitesInProcess(SurefireBooter.java:290)
	at org.apache.maven.surefire.booter.SurefireBooter.main(SurefireBooter.java:1017)


REGRESSION:  org.apache.hadoop.hdfs.server.namenode.metrics.TestNameNodeMetrics.testCorruptBlock

Error Message:
 Argument(s) are different! Wanted: metricsRecordBuilder.addGauge(     Info with name=CorruptBlocks,
    1 ); -> at org.apache.hadoop.test.MetricsAsserts.assertGauge(MetricsAsserts.java:164)
Actual invocation has different arguments: metricsRecordBuilder.addGauge(     MetricsInfoImpl{name=MissingBlocks,
description=Number of missing blocks},     0 ); -> at org.apache.hadoop.metrics2.lib.MethodMetric$2.snapshot(MethodMetric.java:113)


Stack Trace:
Argument(s) are different! Wanted:
metricsRecordBuilder.addGauge(
    Info with name=CorruptBlocks,
    1
);
-> at org.apache.hadoop.test.MetricsAsserts.assertGauge(MetricsAsserts.java:164)
Actual invocation has different arguments:
metricsRecordBuilder.addGauge(
    MetricsInfoImpl{name=MissingBlocks, description=Number of missing blocks},
    0
);
-> at org.apache.hadoop.metrics2.lib.MethodMetric$2.snapshot(MethodMetric.java:113)

	at sun.reflect.NativeConstructorAccessorImpl.newInstance0(Native Method)
	at sun.reflect.NativeConstructorAccessorImpl.newInstance(NativeConstructorAccessorImpl.java:39)
	at sun.reflect.DelegatingConstructorAccessorImpl.newInstance(DelegatingConstructorAccessorImpl.java:27)
	at java.lang.reflect.Constructor.newInstance(Constructor.java:513)
	at org.apache.hadoop.test.MetricsAsserts.assertGauge(MetricsAsserts.java:164)
	at org.apache.hadoop.hdfs.server.namenode.metrics.TestNameNodeMetrics.__CLR3_0_2t8sh531hzi(TestNameNodeMetrics.java:175)
	at org.apache.hadoop.hdfs.server.namenode.metrics.TestNameNodeMetrics.testCorruptBlock(TestNameNodeMetrics.java:164)
	at sun.reflect.NativeMethodAccessorImpl.invoke0(Native Method)
	at sun.reflect.NativeMethodAccessorImpl.invoke(NativeMethodAccessorImpl.java:39)
	at sun.reflect.DelegatingMethodAccessorImpl.invoke(DelegatingMethodAccessorImpl.java:25)
	at java.lang.reflect.Method.invoke(Method.java:597)
	at junit.framework.TestCase.runTest(TestCase.java:168)
	at junit.framework.TestCase.runBare(TestCase.java:134)
	at junit.framework.TestResult$1.protect(TestResult.java:110)
	at junit.framework.TestResult.runProtected(TestResult.java:128)
	at junit.framework.TestResult.run(TestResult.java:113)
	at junit.framework.TestCase.run(TestCase.java:124)
	at junit.framework.TestSuite.runTest(TestSuite.java:232)
	at junit.framework.TestSuite.run(TestSuite.java:227)
	at org.junit.internal.runners.JUnit38ClassRunner.run(JUnit38ClassRunner.java:83)
	at org.apache.maven.surefire.junit4.JUnit4TestSet.execute(JUnit4TestSet.java:59)
	at org.apache.maven.surefire.suite.AbstractDirectoryTestSuite.executeTestSet(AbstractDirectoryTestSuite.java:120)
	at org.apache.maven.surefire.suite.AbstractDirectoryTestSuite.execute(AbstractDirectoryTestSuite.java:145)
	at org.apache.maven.surefire.Surefire.run(Surefire.java:104)
	at sun.reflect.NativeMethodAccessorImpl.invoke0(Native Method)
	at sun.reflect.NativeMethodAccessorImpl.invoke(NativeMethodAccessorImpl.java:39)
	at sun.reflect.DelegatingMethodAccessorImpl.invoke(DelegatingMethodAccessorImpl.java:25)
	at java.lang.reflect.Method.invoke(Method.java:597)
	at org.apache.maven.surefire.booter.SurefireBooter.runSuitesInProcess(SurefireBooter.java:290)
	at org.apache.maven.surefire.booter.SurefireBooter.main(SurefireBooter.java:1017)


FAILED:  org.apache.hadoop.hdfs.TestDfsOverAvroRpc.testWorkingDirectory

Error Message:
Two methods with same name: delete

Stack Trace:
org.apache.avro.AvroTypeException: Two methods with same name: delete
	at org.apache.avro.reflect.ReflectData.getProtocol(ReflectData.java:394)
	at org.apache.avro.ipc.reflect.ReflectResponder.<init>(ReflectResponder.java:36)
	at org.apache.hadoop.ipc.AvroRpcEngine.createResponder(AvroRpcEngine.java:189)
	at org.apache.hadoop.ipc.AvroRpcEngine$TunnelResponder.<init>(AvroRpcEngine.java:196)
	at org.apache.hadoop.ipc.AvroRpcEngine.getServer(AvroRpcEngine.java:232)
	at org.apache.hadoop.ipc.RPC.getServer(RPC.java:550)
	at org.apache.hadoop.hdfs.server.namenode.NameNodeRpcServer.<init>(NameNodeRpcServer.java:144)
	at org.apache.hadoop.hdfs.server.namenode.NameNode.createRpcServer(NameNode.java:350)
	at org.apache.hadoop.hdfs.server.namenode.NameNode.initialize(NameNode.java:328)
	at org.apache.hadoop.hdfs.server.namenode.NameNode.<init>(NameNode.java:452)
	at org.apache.hadoop.hdfs.server.namenode.NameNode.<init>(NameNode.java:444)
	at org.apache.hadoop.hdfs.server.namenode.NameNode.createNameNode(NameNode.java:742)
	at org.apache.hadoop.hdfs.MiniDFSCluster.createNameNode(MiniDFSCluster.java:637)
	at org.apache.hadoop.hdfs.MiniDFSCluster.initMiniDFSCluster(MiniDFSCluster.java:541)
	at org.apache.hadoop.hdfs.MiniDFSCluster.<init>(MiniDFSCluster.java:257)
	at org.apache.hadoop.hdfs.MiniDFSCluster.<init>(MiniDFSCluster.java:85)
	at org.apache.hadoop.hdfs.MiniDFSCluster$Builder.build(MiniDFSCluster.java:243)
	at org.apache.hadoop.hdfs.TestLocalDFS.__CLR3_0_2hl5jzp16da(TestLocalDFS.java:64)
	at org.apache.hadoop.hdfs.TestLocalDFS.testWorkingDirectory(TestLocalDFS.java:62)
	at org.apache.hadoop.hdfs.TestDfsOverAvroRpc.__CLR3_0_2hl5jzp13ks(TestDfsOverAvroRpc.java:30)
	at org.apache.hadoop.hdfs.TestDfsOverAvroRpc.testWorkingDirectory(TestDfsOverAvroRpc.java:27)
	at sun.reflect.NativeMethodAccessorImpl.invoke0(Native Method)
	at sun.reflect.NativeMethodAccessorImpl.invoke(NativeMethodAccessorImpl.java:39)
	at sun.reflect.DelegatingMethodAccessorImpl.invoke(DelegatingMethodAccessorImpl.java:25)
	at java.lang.reflect.Method.invoke(Method.java:597)
	at junit.framework.TestCase.runTest(TestCase.java:168)
	at junit.framework.TestCase.runBare(TestCase.java:134)
	at junit.framework.TestResult$1.protect(TestResult.java:110)
	at junit.framework.TestResult.runProtected(TestResult.java:128)
	at junit.framework.TestResult.run(TestResult.java:113)
	at junit.framework.TestCase.run(TestCase.java:124)
	at junit.framework.TestSuite.runTest(TestSuite.java:232)
	at junit.framework.TestSuite.run(TestSuite.java:227)
	at org.junit.internal.runners.JUnit38ClassRunner.run(JUnit38ClassRunner.java:83)
	at org.apache.maven.surefire.junit4.JUnit4TestSet.execute(JUnit4TestSet.java:59)
	at org.apache.maven.surefire.suite.AbstractDirectoryTestSuite.executeTestSet(AbstractDirectoryTestSuite.java:120)
	at org.apache.maven.surefire.suite.AbstractDirectoryTestSuite.execute(AbstractDirectoryTestSuite.java:145)
	at org.apache.maven.surefire.Surefire.run(Surefire.java:104)
	at sun.reflect.NativeMethodAccessorImpl.invoke0(Native Method)
	at sun.reflect.NativeMethodAccessorImpl.invoke(NativeMethodAccessorImpl.java:39)
	at sun.reflect.DelegatingMethodAccessorImpl.invoke(DelegatingMethodAccessorImpl.java:25)
	at java.lang.reflect.Method.invoke(Method.java:597)
	at org.apache.maven.surefire.booter.SurefireBooter.runSuitesInProcess(SurefireBooter.java:290)
	at org.apache.maven.surefire.booter.SurefireBooter.main(SurefireBooter.java:1017)




Mime
View raw message