hadoop-hdfs-dev mailing list archives

Site index · List index
Message view « Date » · « Thread »
Top « Date » · « Thread »
From Apache Jenkins Server <jenk...@builds.apache.org>
Subject Hadoop-Hdfs-0.23-Commit - Build # 106 - Failure
Date Mon, 31 Oct 2011 03:43:28 GMT
See https://builds.apache.org/job/Hadoop-Hdfs-0.23-Commit/106/

###################################################################################
########################## LAST 60 LINES OF THE CONSOLE ###########################
[...truncated 6776 lines...]
[INFO] Copying 2 resources
[INFO] 
[INFO] --- maven-compiler-plugin:2.3.2:compile (default-compile) @ hadoop-hdfs ---
[INFO] Nothing to compile - all classes are up to date
[INFO] 
[INFO] --- maven-antrun-plugin:1.6:run (create-web-xmls) @ hadoop-hdfs ---
[INFO] Executing tasks

main:
[INFO] Executed tasks
[INFO] 
[INFO] --- maven-resources-plugin:2.4.3:testResources (default-testResources) @ hadoop-hdfs
---
[INFO] Using 'UTF-8' encoding to copy filtered resources.
[INFO] Copying 20 resources
[INFO] 
[INFO] --- maven-antrun-plugin:1.6:run (create-log-dir) @ hadoop-hdfs ---
[INFO] Executing tasks

main:
   [delete] Deleting directory /home/jenkins/jenkins-slave/workspace/Hadoop-Hdfs-0.23-Commit/trunk/hadoop-hdfs-project/hadoop-hdfs/target/test/data
    [mkdir] Created dir: /home/jenkins/jenkins-slave/workspace/Hadoop-Hdfs-0.23-Commit/trunk/hadoop-hdfs-project/hadoop-hdfs/target/test/data
[INFO] Executed tasks
[INFO] 
[INFO] --- maven-compiler-plugin:2.3.2:testCompile (default-testCompile) @ hadoop-hdfs ---
[INFO] Nothing to compile - all classes are up to date
[INFO] 
[INFO] --- maven-surefire-plugin:2.9:test (default-test) @ hadoop-hdfs ---
[INFO] Tests are skipped.
[INFO] 
[INFO] --- maven-antrun-plugin:1.6:run (xprepare-package-hadoop-daemon) @ hadoop-hdfs ---
[INFO] Executing tasks

main:
      [get] Getting: http://archive.apache.org/dist/commons/daemon/binaries/1.0.3/linux/commons-daemon-1.0.3-bin-linux-i686.tar.gz
      [get] To: /home/jenkins/jenkins-slave/workspace/Hadoop-Hdfs-0.23-Commit/trunk/hadoop-hdfs-project/hadoop-hdfs/downloads/commons-daemon-1.0.3-bin-linux-i686.tar.gz
      [get] Error getting http://archive.apache.org/dist/commons/daemon/binaries/1.0.3/linux/commons-daemon-1.0.3-bin-linux-i686.tar.gz
to /home/jenkins/jenkins-slave/workspace/Hadoop-Hdfs-0.23-Commit/trunk/hadoop-hdfs-project/hadoop-hdfs/downloads/commons-daemon-1.0.3-bin-linux-i686.tar.gz
[INFO] ------------------------------------------------------------------------
[INFO] Reactor Summary:
[INFO] 
[INFO] Apache Hadoop HDFS ................................ FAILURE [3.850s]
[INFO] Apache Hadoop HDFS Project ........................ SKIPPED
[INFO] ------------------------------------------------------------------------
[INFO] BUILD FAILURE
[INFO] ------------------------------------------------------------------------
[INFO] Total time: 4.073s
[INFO] Finished at: Mon Oct 31 03:43:27 UTC 2011
[INFO] Final Memory: 12M/151M
[INFO] ------------------------------------------------------------------------
[ERROR] Failed to execute goal org.apache.maven.plugins:maven-antrun-plugin:1.6:run (xprepare-package-hadoop-daemon)
on project hadoop-hdfs: An Ant BuildException has occured: java.net.SocketException: Connection
reset -> [Help 1]
[ERROR] 
[ERROR] To see the full stack trace of the errors, re-run Maven with the -e switch.
[ERROR] Re-run Maven using the -X switch to enable full debug logging.
[ERROR] 
[ERROR] For more information about the errors and possible solutions, please read the following
articles:
[ERROR] [Help 1] http://cwiki.apache.org/confluence/display/MAVEN/MojoExecutionException
Build step 'Execute shell' marked build as failure
Updating MAPREDUCE-3313
Email was triggered for: Failure
Sending email for trigger: Failure



###################################################################################
############################## FAILED TESTS (if any) ##############################
No tests ran.

Mime
View raw message