hadoop-hdfs-dev mailing list archives

Site index · List index
Message view « Date » · « Thread »
Top « Date » · « Thread »
From Apache Jenkins Server <jenk...@builds.apache.org>
Subject Hadoop-Hdfs-trunk-Commit - Build # 1221 - Failure
Date Mon, 24 Oct 2011 18:42:19 GMT
See https://builds.apache.org/job/Hadoop-Hdfs-trunk-Commit/1221/

###################################################################################
########################## LAST 60 LINES OF THE CONSOLE ###########################
[...truncated 7034 lines...]
[ERROR] /home/jenkins/jenkins-slave/workspace/Hadoop-Hdfs-trunk-Commit/trunk/hadoop-hdfs-project/hadoop-hdfs/src/main/java/org/apache/hadoop/hdfs/server/blockmanagement/DatanodeManager.java:[873,39]
cannot find symbol
symbol  : variable RegisterCommand
location: class org.apache.hadoop.hdfs.server.blockmanagement.DatanodeManager
[ERROR] /home/jenkins/jenkins-slave/workspace/Hadoop-Hdfs-trunk-Commit/trunk/hadoop-hdfs-project/hadoop-hdfs/src/main/java/org/apache/hadoop/hdfs/server/datanode/DataNode.java:[1422,34]
cannot find symbol
symbol  : class FinalizeCommand
location: class org.apache.hadoop.hdfs.server.datanode.DataNode.BPOfferService
[INFO] 9 errors 
[INFO] -------------------------------------------------------------
[INFO] ------------------------------------------------------------------------
[INFO] Reactor Summary:
[INFO] 
[INFO] Apache Hadoop HDFS ................................ FAILURE [7.943s]
[INFO] Apache Hadoop HDFS Project ........................ SKIPPED
[INFO] ------------------------------------------------------------------------
[INFO] BUILD FAILURE
[INFO] ------------------------------------------------------------------------
[INFO] Total time: 8.161s
[INFO] Finished at: Mon Oct 24 18:42:17 UTC 2011
[INFO] Final Memory: 19M/249M
[INFO] ------------------------------------------------------------------------
[ERROR] Failed to execute goal org.apache.maven.plugins:maven-compiler-plugin:2.3.2:compile
(default-compile) on project hadoop-hdfs: Compilation failure: Compilation failure:
[ERROR] /home/jenkins/jenkins-slave/workspace/Hadoop-Hdfs-trunk-Commit/trunk/hadoop-hdfs-project/hadoop-hdfs/src/main/java/org/apache/hadoop/hdfs/server/namenode/NameNodeRpcServer.java:[72,45]
cannot find symbol
[ERROR] symbol  : class FinalizeCommand
[ERROR] location: package org.apache.hadoop.hdfs.server.protocol
[ERROR] /home/jenkins/jenkins-slave/workspace/Hadoop-Hdfs-trunk-Commit/trunk/hadoop-hdfs-project/hadoop-hdfs/src/main/java/org/apache/hadoop/hdfs/server/blockmanagement/DatanodeManager.java:[63,45]
cannot find symbol
[ERROR] symbol  : class RegisterCommand
[ERROR] location: package org.apache.hadoop.hdfs.server.protocol
[ERROR] /home/jenkins/jenkins-slave/workspace/Hadoop-Hdfs-trunk-Commit/trunk/hadoop-hdfs-project/hadoop-hdfs/src/main/java/org/apache/hadoop/hdfs/server/datanode/DataNode.java:[154,45]
cannot find symbol
[ERROR] symbol  : class FinalizeCommand
[ERROR] location: package org.apache.hadoop.hdfs.server.protocol
[ERROR] /home/jenkins/jenkins-slave/workspace/Hadoop-Hdfs-trunk-Commit/trunk/hadoop-hdfs-project/hadoop-hdfs/src/main/java/org/apache/hadoop/hdfs/server/protocol/DatanodeCommand.java:[31,6]
cannot find symbol
[ERROR] symbol: class RegisterCommand
[ERROR] RegisterCommand.class, FinalizeCommand.class,
[ERROR] /home/jenkins/jenkins-slave/workspace/Hadoop-Hdfs-trunk-Commit/trunk/hadoop-hdfs-project/hadoop-hdfs/src/main/java/org/apache/hadoop/hdfs/server/protocol/DatanodeCommand.java:[31,29]
cannot find symbol
[ERROR] symbol: class FinalizeCommand
[ERROR] RegisterCommand.class, FinalizeCommand.class,
[ERROR] /home/jenkins/jenkins-slave/workspace/Hadoop-Hdfs-trunk-Commit/trunk/hadoop-hdfs-project/hadoop-hdfs/src/main/java/org/apache/hadoop/hdfs/server/namenode/NameNodeRpcServer.java:[807,17]
cannot find symbol
[ERROR] symbol  : class FinalizeCommand
[ERROR] location: class org.apache.hadoop.hdfs.server.namenode.NameNodeRpcServer
[ERROR] /home/jenkins/jenkins-slave/workspace/Hadoop-Hdfs-trunk-Commit/trunk/hadoop-hdfs-project/hadoop-hdfs/src/main/java/org/apache/hadoop/hdfs/server/blockmanagement/DatanodeManager.java:[863,39]
cannot find symbol
[ERROR] symbol  : variable RegisterCommand
[ERROR] location: class org.apache.hadoop.hdfs.server.blockmanagement.DatanodeManager
[ERROR] /home/jenkins/jenkins-slave/workspace/Hadoop-Hdfs-trunk-Commit/trunk/hadoop-hdfs-project/hadoop-hdfs/src/main/java/org/apache/hadoop/hdfs/server/blockmanagement/DatanodeManager.java:[873,39]
cannot find symbol
[ERROR] symbol  : variable RegisterCommand
[ERROR] location: class org.apache.hadoop.hdfs.server.blockmanagement.DatanodeManager
[ERROR] /home/jenkins/jenkins-slave/workspace/Hadoop-Hdfs-trunk-Commit/trunk/hadoop-hdfs-project/hadoop-hdfs/src/main/java/org/apache/hadoop/hdfs/server/datanode/DataNode.java:[1422,34]
cannot find symbol
[ERROR] symbol  : class FinalizeCommand
[ERROR] location: class org.apache.hadoop.hdfs.server.datanode.DataNode.BPOfferService
[ERROR] -> [Help 1]
[ERROR] 
[ERROR] To see the full stack trace of the errors, re-run Maven with the -e switch.
[ERROR] Re-run Maven using the -X switch to enable full debug logging.
[ERROR] 
[ERROR] For more information about the errors and possible solutions, please read the following
articles:
[ERROR] [Help 1] http://cwiki.apache.org/confluence/display/MAVEN/MojoFailureException
Build step 'Execute shell' marked build as failure
Updating HDFS-2489
Email was triggered for: Failure
Sending email for trigger: Failure



###################################################################################
############################## FAILED TESTS (if any) ##############################
No tests ran.

Mime
View raw message