hadoop-hdfs-dev mailing list archives

Site index · List index
Message view « Date » · « Thread »
Top « Date » · « Thread »
From Apache Jenkins Server <jenk...@builds.apache.org>
Subject Hadoop-Hdfs-0.23-Commit - Build # 65 - Still Failing
Date Wed, 26 Oct 2011 22:14:02 GMT
See https://builds.apache.org/job/Hadoop-Hdfs-0.23-Commit/65/

###################################################################################
########################## LAST 60 LINES OF THE CONSOLE ###########################
[...truncated 6868 lines...]
WARN: Please see http://www.slf4j.org/codes.html for an explanation.
[INFO] Compiled completed in 0:00:00.014
[INFO] 
[INFO] --- jspc-maven-plugin:2.0-alpha-3:compile (datanode) @ hadoop-hdfs ---
[WARNING] Compiled JSPs will not be added to the project and web.xml will not be modified,
either because includeInProject is set to false or because the project's packaging is not
'war'.
[INFO] Compiling 3 JSP source files to /home/jenkins/jenkins-slave/workspace/Hadoop-Hdfs-0.23-Commit/trunk/hadoop-hdfs-project/hadoop-hdfs/target/generated-src/main/jsp
WARN: The method class org.apache.commons.logging.impl.SLF4JLogFactory#release() was invoked.
WARN: Please see http://www.slf4j.org/codes.html for an explanation.
[INFO] Compiled completed in 0:00:00.015
[INFO] 
[INFO] --- build-helper-maven-plugin:1.5:add-source (add-source) @ hadoop-hdfs ---
[INFO] Source directory: /home/jenkins/jenkins-slave/workspace/Hadoop-Hdfs-0.23-Commit/trunk/hadoop-hdfs-project/hadoop-hdfs/target/generated-src/main/jsp
added.
[INFO] 
[INFO] --- maven-resources-plugin:2.4.3:resources (default-resources) @ hadoop-hdfs ---
[INFO] Using 'UTF-8' encoding to copy filtered resources.
[INFO] Copying 2 resources
[INFO] 
[INFO] --- maven-compiler-plugin:2.3.2:compile (default-compile) @ hadoop-hdfs ---
[INFO] Compiling 67 source files to /home/jenkins/jenkins-slave/workspace/Hadoop-Hdfs-0.23-Commit/trunk/hadoop-hdfs-project/hadoop-hdfs/target/classes
[INFO] -------------------------------------------------------------
[ERROR] COMPILATION ERROR : 
[INFO] -------------------------------------------------------------
[ERROR] /home/jenkins/jenkins-slave/workspace/Hadoop-Hdfs-0.23-Commit/trunk/hadoop-hdfs-project/hadoop-hdfs/src/main/java/org/apache/hadoop/hdfs/server/namenode/web/resources/NamenodeWebHdfsMethods.java:[312,28]
cannot find symbol
symbol: variable dstPath
        np.rename(fullpath, dstPath.getValue(),
[INFO] 1 error
[INFO] -------------------------------------------------------------
[INFO] ------------------------------------------------------------------------
[INFO] Reactor Summary:
[INFO] 
[INFO] Apache Hadoop HDFS ................................ FAILURE [5.193s]
[INFO] Apache Hadoop HDFS Project ........................ SKIPPED
[INFO] ------------------------------------------------------------------------
[INFO] BUILD FAILURE
[INFO] ------------------------------------------------------------------------
[INFO] Total time: 5.405s
[INFO] Finished at: Wed Oct 26 22:14:00 UTC 2011
[INFO] Final Memory: 18M/178M
[INFO] ------------------------------------------------------------------------
[ERROR] Failed to execute goal org.apache.maven.plugins:maven-compiler-plugin:2.3.2:compile
(default-compile) on project hadoop-hdfs: Compilation failure
[ERROR] /home/jenkins/jenkins-slave/workspace/Hadoop-Hdfs-0.23-Commit/trunk/hadoop-hdfs-project/hadoop-hdfs/src/main/java/org/apache/hadoop/hdfs/server/namenode/web/resources/NamenodeWebHdfsMethods.java:[312,28]
cannot find symbol
[ERROR] symbol: variable dstPath
[ERROR] np.rename(fullpath, dstPath.getValue(),
[ERROR] -> [Help 1]
[ERROR] 
[ERROR] To see the full stack trace of the errors, re-run Maven with the -e switch.
[ERROR] Re-run Maven using the -X switch to enable full debug logging.
[ERROR] 
[ERROR] For more information about the errors and possible solutions, please read the following
articles:
[ERROR] [Help 1] http://cwiki.apache.org/confluence/display/MAVEN/MojoFailureException
Build step 'Execute shell' marked build as failure
Updating HDFS-2453
Updating HDFS-2424
Updating HDFS-2501
Updating HDFS-2427
Updating HDFS-2428
Updating HDFS-2439
Email was triggered for: Failure
Sending email for trigger: Failure



###################################################################################
############################## FAILED TESTS (if any) ##############################
No tests ran.

Mime
View raw message