hadoop-hdfs-dev mailing list archives

Site index · List index
Message view « Date » · « Thread »
Top « Date » · « Thread »
From Apache Jenkins Server <jenk...@builds.apache.org>
Subject Hadoop-Hdfs-0.23-Build - Build # 24 - Still Unstable
Date Thu, 29 Sep 2011 12:58:56 GMT
See https://builds.apache.org/job/Hadoop-Hdfs-0.23-Build/24/

###################################################################################
########################## LAST 60 LINES OF THE CONSOLE ###########################
[...truncated 9528 lines...]
[INFO] --- maven-antrun-plugin:1.6:run (tar) @ hadoop-hdfs ---
[INFO] Executing tasks

main:
[INFO] Executed tasks
[INFO] 
[INFO] --- maven-checkstyle-plugin:2.6:checkstyle (default-cli) @ hadoop-hdfs ---
[INFO] 
[INFO] There are 9007 checkstyle errors.
[WARNING] Unable to locate Source XRef to link to - DISABLED
[INFO] 
[INFO] --- findbugs-maven-plugin:2.3.2:findbugs (default-cli) @ hadoop-hdfs ---
[INFO] ****** FindBugsMojo execute *******
[INFO] canGenerate is true
[INFO] ****** FindBugsMojo executeFindbugs *******
[INFO] Temp File is /home/jenkins/jenkins-slave/workspace/Hadoop-Hdfs-0.23-Build/trunk/hadoop-hdfs-project/hadoop-hdfs/target/findbugsTemp.xml
[INFO] Fork Value is true
[INFO] xmlOutput is false
[INFO]                                                                         
[INFO] ------------------------------------------------------------------------
[INFO] Building Apache Hadoop HDFS Project 0.23.0-SNAPSHOT
[INFO] ------------------------------------------------------------------------
[INFO] 
[INFO] --- maven-clean-plugin:2.4.1:clean (default-clean) @ hadoop-hdfs-project ---
[INFO] 
[INFO] --- maven-checkstyle-plugin:2.6:checkstyle (default-cli) @ hadoop-hdfs-project ---
[INFO] 
[INFO] --- findbugs-maven-plugin:2.3.2:findbugs (default-cli) @ hadoop-hdfs-project ---
[INFO] ****** FindBugsMojo execute *******
[INFO] canGenerate is false
[INFO] ------------------------------------------------------------------------
[INFO] Reactor Summary:
[INFO] 
[INFO] Apache Hadoop HDFS ................................ SUCCESS [3:32.393s]
[INFO] Apache Hadoop HDFS Project ........................ SUCCESS [0.056s]
[INFO] ------------------------------------------------------------------------
[INFO] BUILD SUCCESS
[INFO] ------------------------------------------------------------------------
[INFO] Total time: 3:32.885s
[INFO] Finished at: Thu Sep 29 11:37:29 UTC 2011
[INFO] Final Memory: 58M/761M
[INFO] ------------------------------------------------------------------------
+ /home/jenkins/tools/maven/latest/bin/mvn test -Dmaven.test.failure.ignore=true -Pclover
-DcloverLicenseLocation=/home/jenkins/tools/clover/latest/lib/clover.license
Archiving artifacts
Publishing Clover coverage report...
Publishing Clover HTML report...
Publishing Clover XML report...
Publishing Clover coverage results...
Recording test results
Build step 'Publish JUnit test result report' changed build result to UNSTABLE
Publishing Javadoc
Recording fingerprints
Updating HDFS-2346
Updating HDFS-2345
Updating HADOOP-7662
Updating MAPREDUCE-3114
Sending e-mails to: hdfs-dev@hadoop.apache.org
Email was triggered for: Unstable
Sending email for trigger: Unstable



###################################################################################
############################## FAILED TESTS (if any) ##############################
2 tests failed.
REGRESSION:  org.apache.hadoop.hdfs.server.namenode.metrics.TestNameNodeMetrics.testCorruptBlock

Error Message:
 Argument(s) are different! Wanted: metricsRecordBuilder.addGauge(     Info with name=CorruptBlocks,
    1 ); -> at org.apache.hadoop.test.MetricsAsserts.assertGauge(MetricsAsserts.java:164)
Actual invocation has different arguments: metricsRecordBuilder.addGauge(     MetricsInfoImpl{name=UnderReplicatedBlocks,
description=UnderReplicatedBlocks},     0 ); -> at org.apache.hadoop.metrics2.lib.MethodMetric$2.snapshot(MethodMetric.java:113)


Stack Trace:
Argument(s) are different! Wanted:
metricsRecordBuilder.addGauge(
    Info with name=CorruptBlocks,
    1
);
-> at org.apache.hadoop.test.MetricsAsserts.assertGauge(MetricsAsserts.java:164)
Actual invocation has different arguments:
metricsRecordBuilder.addGauge(
    MetricsInfoImpl{name=UnderReplicatedBlocks, description=UnderReplicatedBlocks},
    0
);
-> at org.apache.hadoop.metrics2.lib.MethodMetric$2.snapshot(MethodMetric.java:113)

	at sun.reflect.NativeConstructorAccessorImpl.newInstance0(Native Method)
	at sun.reflect.NativeConstructorAccessorImpl.newInstance(NativeConstructorAccessorImpl.java:39)
	at sun.reflect.DelegatingConstructorAccessorImpl.newInstance(DelegatingConstructorAccessorImpl.java:27)
	at java.lang.reflect.Constructor.newInstance(Constructor.java:513)
	at org.apache.hadoop.test.MetricsAsserts.assertGauge(MetricsAsserts.java:164)
	at org.apache.hadoop.hdfs.server.namenode.metrics.TestNameNodeMetrics.__CLR3_0_2t8sh531hzi(TestNameNodeMetrics.java:175)
	at org.apache.hadoop.hdfs.server.namenode.metrics.TestNameNodeMetrics.testCorruptBlock(TestNameNodeMetrics.java:164)
	at sun.reflect.NativeMethodAccessorImpl.invoke0(Native Method)
	at sun.reflect.NativeMethodAccessorImpl.invoke(NativeMethodAccessorImpl.java:39)
	at sun.reflect.DelegatingMethodAccessorImpl.invoke(DelegatingMethodAccessorImpl.java:25)
	at java.lang.reflect.Method.invoke(Method.java:597)
	at junit.framework.TestCase.runTest(TestCase.java:168)
	at junit.framework.TestCase.runBare(TestCase.java:134)
	at junit.framework.TestResult$1.protect(TestResult.java:110)
	at junit.framework.TestResult.runProtected(TestResult.java:128)
	at junit.framework.TestResult.run(TestResult.java:113)
	at junit.framework.TestCase.run(TestCase.java:124)
	at junit.framework.TestSuite.runTest(TestSuite.java:232)
	at junit.framework.TestSuite.run(TestSuite.java:227)
	at org.junit.internal.runners.JUnit38ClassRunner.run(JUnit38ClassRunner.java:83)
	at org.apache.maven.surefire.junit4.JUnit4TestSet.execute(JUnit4TestSet.java:59)
	at org.apache.maven.surefire.suite.AbstractDirectoryTestSuite.executeTestSet(AbstractDirectoryTestSuite.java:120)
	at org.apache.maven.surefire.suite.AbstractDirectoryTestSuite.execute(AbstractDirectoryTestSuite.java:145)
	at org.apache.maven.surefire.Surefire.run(Surefire.java:104)
	at sun.reflect.NativeMethodAccessorImpl.invoke0(Native Method)
	at sun.reflect.NativeMethodAccessorImpl.invoke(NativeMethodAccessorImpl.java:39)
	at sun.reflect.DelegatingMethodAccessorImpl.invoke(DelegatingMethodAccessorImpl.java:25)
	at java.lang.reflect.Method.invoke(Method.java:597)
	at org.apache.maven.surefire.booter.SurefireBooter.runSuitesInProcess(SurefireBooter.java:290)
	at org.apache.maven.surefire.booter.SurefireBooter.main(SurefireBooter.java:1017)


FAILED:  org.apache.hadoop.hdfs.TestDfsOverAvroRpc.testWorkingDirectory

Error Message:
Two methods with same name: delete

Stack Trace:
org.apache.avro.AvroTypeException: Two methods with same name: delete
	at org.apache.avro.reflect.ReflectData.getProtocol(ReflectData.java:394)
	at org.apache.avro.ipc.reflect.ReflectResponder.<init>(ReflectResponder.java:36)
	at org.apache.hadoop.ipc.AvroRpcEngine.createResponder(AvroRpcEngine.java:189)
	at org.apache.hadoop.ipc.AvroRpcEngine$TunnelResponder.<init>(AvroRpcEngine.java:196)
	at org.apache.hadoop.ipc.AvroRpcEngine.getServer(AvroRpcEngine.java:232)
	at org.apache.hadoop.ipc.RPC.getServer(RPC.java:550)
	at org.apache.hadoop.hdfs.server.namenode.NameNodeRpcServer.<init>(NameNodeRpcServer.java:144)
	at org.apache.hadoop.hdfs.server.namenode.NameNode.createRpcServer(NameNode.java:350)
	at org.apache.hadoop.hdfs.server.namenode.NameNode.initialize(NameNode.java:328)
	at org.apache.hadoop.hdfs.server.namenode.NameNode.<init>(NameNode.java:452)
	at org.apache.hadoop.hdfs.server.namenode.NameNode.<init>(NameNode.java:444)
	at org.apache.hadoop.hdfs.server.namenode.NameNode.createNameNode(NameNode.java:742)
	at org.apache.hadoop.hdfs.MiniDFSCluster.createNameNode(MiniDFSCluster.java:637)
	at org.apache.hadoop.hdfs.MiniDFSCluster.initMiniDFSCluster(MiniDFSCluster.java:541)
	at org.apache.hadoop.hdfs.MiniDFSCluster.<init>(MiniDFSCluster.java:257)
	at org.apache.hadoop.hdfs.MiniDFSCluster.<init>(MiniDFSCluster.java:85)
	at org.apache.hadoop.hdfs.MiniDFSCluster$Builder.build(MiniDFSCluster.java:243)
	at org.apache.hadoop.hdfs.TestLocalDFS.__CLR3_0_2hl5jzp16da(TestLocalDFS.java:64)
	at org.apache.hadoop.hdfs.TestLocalDFS.testWorkingDirectory(TestLocalDFS.java:62)
	at org.apache.hadoop.hdfs.TestDfsOverAvroRpc.__CLR3_0_2hl5jzp13ks(TestDfsOverAvroRpc.java:30)
	at org.apache.hadoop.hdfs.TestDfsOverAvroRpc.testWorkingDirectory(TestDfsOverAvroRpc.java:27)
	at sun.reflect.NativeMethodAccessorImpl.invoke0(Native Method)
	at sun.reflect.NativeMethodAccessorImpl.invoke(NativeMethodAccessorImpl.java:39)
	at sun.reflect.DelegatingMethodAccessorImpl.invoke(DelegatingMethodAccessorImpl.java:25)
	at java.lang.reflect.Method.invoke(Method.java:597)
	at junit.framework.TestCase.runTest(TestCase.java:168)
	at junit.framework.TestCase.runBare(TestCase.java:134)
	at junit.framework.TestResult$1.protect(TestResult.java:110)
	at junit.framework.TestResult.runProtected(TestResult.java:128)
	at junit.framework.TestResult.run(TestResult.java:113)
	at junit.framework.TestCase.run(TestCase.java:124)
	at junit.framework.TestSuite.runTest(TestSuite.java:232)
	at junit.framework.TestSuite.run(TestSuite.java:227)
	at org.junit.internal.runners.JUnit38ClassRunner.run(JUnit38ClassRunner.java:83)
	at org.apache.maven.surefire.junit4.JUnit4TestSet.execute(JUnit4TestSet.java:59)
	at org.apache.maven.surefire.suite.AbstractDirectoryTestSuite.executeTestSet(AbstractDirectoryTestSuite.java:120)
	at org.apache.maven.surefire.suite.AbstractDirectoryTestSuite.execute(AbstractDirectoryTestSuite.java:145)
	at org.apache.maven.surefire.Surefire.run(Surefire.java:104)
	at sun.reflect.NativeMethodAccessorImpl.invoke0(Native Method)
	at sun.reflect.NativeMethodAccessorImpl.invoke(NativeMethodAccessorImpl.java:39)
	at sun.reflect.DelegatingMethodAccessorImpl.invoke(DelegatingMethodAccessorImpl.java:25)
	at java.lang.reflect.Method.invoke(Method.java:597)
	at org.apache.maven.surefire.booter.SurefireBooter.runSuitesInProcess(SurefireBooter.java:290)
	at org.apache.maven.surefire.booter.SurefireBooter.main(SurefireBooter.java:1017)




Mime
View raw message