hadoop-hdfs-dev mailing list archives

Site index · List index
Message view « Date » · « Thread »
Top « Date » · « Thread »
From Apache Jenkins Server <jenk...@builds.apache.org>
Subject Hadoop-Hdfs-0.23-Build - Build # 22 - Failure
Date Tue, 27 Sep 2011 11:56:05 GMT
See https://builds.apache.org/job/Hadoop-Hdfs-0.23-Build/22/

###################################################################################
########################## LAST 60 LINES OF THE CONSOLE ###########################
[...truncated 9341 lines...]
[INFO] 
[INFO] --- maven-compiler-plugin:2.3.2:compile (default-compile) @ hadoop-hdfs ---
[INFO] Compiling 286 source files to /home/jenkins/jenkins-slave/workspace/Hadoop-Hdfs-0.23-Build/trunk/hadoop-hdfs-project/hadoop-hdfs/target/classes
[INFO] 
[INFO] --- maven-antrun-plugin:1.6:run (create-web-xmls) @ hadoop-hdfs ---
[INFO] Executing tasks

main:
     [copy] Copying 1 file to /home/jenkins/jenkins-slave/workspace/Hadoop-Hdfs-0.23-Build/trunk/hadoop-hdfs-project/hadoop-hdfs/target/webapps/hdfs/WEB-INF
     [copy] Copying 1 file to /home/jenkins/jenkins-slave/workspace/Hadoop-Hdfs-0.23-Build/trunk/hadoop-hdfs-project/hadoop-hdfs/target/webapps/secondary/WEB-INF
     [copy] Copying 1 file to /home/jenkins/jenkins-slave/workspace/Hadoop-Hdfs-0.23-Build/trunk/hadoop-hdfs-project/hadoop-hdfs/target/webapps/datanode/WEB-INF
     [copy] Copying 6 files to /home/jenkins/jenkins-slave/workspace/Hadoop-Hdfs-0.23-Build/trunk/hadoop-hdfs-project/hadoop-hdfs/target/webapps
[INFO] Executed tasks
[INFO] 
[INFO] --- maven-antrun-plugin:1.6:run (compile) @ hadoop-hdfs ---
[INFO] Executing tasks

main:
     [copy] Copying 15 files to /home/jenkins/jenkins-slave/workspace/Hadoop-Hdfs-0.23-Build/trunk/hadoop-hdfs-project/hadoop-hdfs/target/native
     [copy] Copied 6 empty directories to 2 empty directories under /home/jenkins/jenkins-slave/workspace/Hadoop-Hdfs-0.23-Build/trunk/hadoop-hdfs-project/hadoop-hdfs/target/native
[INFO] Executed tasks
[INFO] 
[INFO] --- make-maven-plugin:1.0-beta-1:autoreconf (compile) @ hadoop-hdfs ---
[INFO] ------------------------------------------------------------------------
[INFO] Reactor Summary:
[INFO] 
[INFO] Apache Hadoop HDFS ................................ FAILURE [12.508s]
[INFO] Apache Hadoop HDFS Project ........................ SKIPPED
[INFO] ------------------------------------------------------------------------
[INFO] BUILD FAILURE
[INFO] ------------------------------------------------------------------------
[INFO] Total time: 12.961s
[INFO] Finished at: Tue Sep 27 11:34:24 UTC 2011
[INFO] Final Memory: 25M/235M
[INFO] ------------------------------------------------------------------------
[ERROR] Failed to execute goal org.codehaus.mojo:make-maven-plugin:1.0-beta-1:autoreconf (compile)
on project hadoop-hdfs: autoreconf command returned an exit value != 0. Aborting build; see
debug output for more information. -> [Help 1]
[ERROR] 
[ERROR] To see the full stack trace of the errors, re-run Maven with the -e switch.
[ERROR] Re-run Maven using the -X switch to enable full debug logging.
[ERROR] 
[ERROR] For more information about the errors and possible solutions, please read the following
articles:
[ERROR] [Help 1] http://cwiki.apache.org/confluence/display/MAVEN/MojoExecutionException
+ /home/jenkins/tools/maven/latest/bin/mvn test -Dmaven.test.failure.ignore=true -Pclover
-DcloverLicenseLocation=/home/jenkins/tools/clover/latest/lib/clover.license
Build step 'Execute shell' marked build as failure
Archiving artifacts
Publishing Clover coverage report...
Clover xml file does not exist in: /home/jenkins/jenkins-slave/workspace/Hadoop-Hdfs-0.23-Build/trunk/hadoop-hdfs-project/hadoop-hdfs/target/clover
called: clover.xml and will not be copied to: /home/hudson/hudson/jobs/Hadoop-Hdfs-0.23-Build/builds/2011-09-27_11-31-13/clover.xml
Could not find 'trunk/hadoop-hdfs-project/hadoop-hdfs/target/clover/clover.xml'.  Did you
generate the XML report for Clover?
Recording test results
Publishing Javadoc
Recording fingerprints
Updating MAPREDUCE-2984
Updating MAPREDUCE-3031
Updating MAPREDUCE-3067
Updating MAPREDUCE-2646
Updating MAPREDUCE-3071
Sending e-mails to: hdfs-dev@hadoop.apache.org
Email was triggered for: Failure
Sending email for trigger: Failure



###################################################################################
############################## FAILED TESTS (if any) ##############################
All tests passed

Mime
View raw message