hadoop-hdfs-dev mailing list archives

Site index · List index
Message view « Date » · « Thread »
Top « Date » · « Thread »
From Apache Jenkins Server <jenk...@builds.apache.org>
Subject Hadoop-Hdfs-0.23-Build - Build # 3 - Failure
Date Tue, 13 Sep 2011 19:09:50 GMT
See https://builds.apache.org/job/Hadoop-Hdfs-0.23-Build/3/

###################################################################################
########################## LAST 60 LINES OF THE CONSOLE ###########################
[...truncated 13214 lines...]
28 KB   13 KB   35 KB   324 KB   
28 KB   13 KB   35 KB   324 KB   
28 KB   13 KB   36 KB   324 KB   
28 KB   13 KB   36 KB   324 KB   
28 KB   13 KB   37 KB   324 KB   
28 KB   13 KB   37 KB   324 KB   
28 KB   13 KB   38 KB   324 KB   
28 KB   13 KB   38 KB   324 KB   
28 KB   13 KB   39 KB   324 KB   
28 KB   13 KB   39 KB   324 KB   
28 KB   13 KB   40 KB   324 KB   
28 KB   13 KB   40 KB   324 KB   
28 KB   13 KB   41 KB   324 KB   
28 KB   13 KB   41 KB   324 KB   
28 KB   13 KB   42 KB   324 KB   
28 KB   13 KB   42 KB   324 KB   
28 KB   13 KB   43 KB   324 KB   
28 KB   13 KB   43 KB   324 KB   
28 KB   13 KB   44 KB   324 KB   
28 KB   13 KB   44 KB   324 KB   
28 KB   13 KB   46 KB   324 KB   
28 KB   13 KB   50 KB   324 KB   
28 KB   13 KB   50 KB   324 KB   
                                 
Downloaded: http://repo1.maven.org/maven2/org/sonatype/plexus/plexus-sec-dispatcher/1.1/plexus-sec-dispatcher-1.1.jar
(28 KB at 12.4 KB/sec)
                                 
Downloaded: http://repo1.maven.org/maven2/org/sonatype/plexus/plexus-cipher/1.1/plexus-cipher-1.1.jar
(13 KB at 5.6 KB/sec)
                                 
Downloaded: http://repo1.maven.org/maven2/backport-util-concurrent/backport-util-concurrent/3.1/backport-util-concurrent-3.1.jar
(324 KB at 143.9 KB/sec)
                                 
Downloaded: http://repo1.maven.org/maven2/org/codehaus/plexus/plexus-interpolation/1.8.1/plexus-interpolation-1.8.1.jar
(50 KB at 21.5 KB/sec)
[INFO] ------------------------------------------------------------------------
[INFO] Reactor Summary:
[INFO] 
[INFO] Apache Hadoop HDFS ................................ FAILURE [30.405s]
[INFO] Apache Hadoop HDFS Project ........................ SKIPPED
[INFO] ------------------------------------------------------------------------
[INFO] BUILD FAILURE
[INFO] ------------------------------------------------------------------------
[INFO] Total time: 30.851s
[INFO] Finished at: Tue Sep 13 19:09:49 UTC 2011
[INFO] Final Memory: 28M/266M
[INFO] ------------------------------------------------------------------------
[ERROR] Failed to execute goal org.codehaus.mojo:make-maven-plugin:1.0-beta-1:autoreconf (compile)
on project hadoop-hdfs: autoreconf command returned an exit value != 0. Aborting build; see
debug output for more information. -> [Help 1]
[ERROR] 
[ERROR] To see the full stack trace of the errors, re-run Maven with the -e switch.
[ERROR] Re-run Maven using the -X switch to enable full debug logging.
[ERROR] 
[ERROR] For more information about the errors and possible solutions, please read the following
articles:
[ERROR] [Help 1] http://cwiki.apache.org/confluence/display/MAVEN/MojoExecutionException
Build step 'Execute shell' marked build as failure
[WARNINGS] Skipping publisher since build result is FAILURE
Archiving artifacts
Recording test results
Publishing Javadoc
Recording fingerprints
Sending e-mails to: hdfs-dev@hadoop.apache.org
Email was triggered for: Failure
Sending email for trigger: Failure



###################################################################################
############################## FAILED TESTS (if any) ##############################
No tests ran.

Mime
View raw message