hadoop-hdfs-dev mailing list archives

Site index · List index
Message view « Date » · « Thread »
Top « Date » · « Thread »
From Apache Jenkins Server <jenk...@builds.apache.org>
Subject Hadoop-Hdfs-trunk - Build # 812 - Still Unstable
Date Mon, 26 Sep 2011 12:51:01 GMT
See https://builds.apache.org/job/Hadoop-Hdfs-trunk/812/

###################################################################################
########################## LAST 60 LINES OF THE CONSOLE ###########################
[...truncated 9841 lines...]
main:
[INFO] Executed tasks
[INFO] 
[INFO] --- maven-checkstyle-plugin:2.6:checkstyle (default-cli) @ hadoop-hdfs ---
[INFO] 
[INFO] There are 9344 checkstyle errors.
[WARNING] Unable to locate Source XRef to link to - DISABLED
[INFO] 
[INFO] --- findbugs-maven-plugin:2.3.2:findbugs (default-cli) @ hadoop-hdfs ---
[INFO] ****** FindBugsMojo execute *******
[INFO] canGenerate is true
[INFO] ****** FindBugsMojo executeFindbugs *******
[INFO] Temp File is /home/jenkins/jenkins-slave/workspace/Hadoop-Hdfs-trunk/trunk/hadoop-hdfs-project/hadoop-hdfs/target/findbugsTemp.xml
[INFO] Fork Value is true
[INFO] xmlOutput is false
[INFO]                                                                         
[INFO] ------------------------------------------------------------------------
[INFO] Building Apache Hadoop HDFS Project 0.24.0-SNAPSHOT
[INFO] ------------------------------------------------------------------------
[INFO] 
[INFO] --- maven-clean-plugin:2.4.1:clean (default-clean) @ hadoop-hdfs-project ---
[INFO] Deleting /home/jenkins/jenkins-slave/workspace/Hadoop-Hdfs-trunk/trunk/hadoop-hdfs-project/target
[INFO] 
[INFO] --- maven-antrun-plugin:1.6:run (create-testdirs) @ hadoop-hdfs-project ---
[INFO] Executing tasks

main:
    [mkdir] Created dir: /home/jenkins/jenkins-slave/workspace/Hadoop-Hdfs-trunk/trunk/hadoop-hdfs-project/target/test-dir
[INFO] Executed tasks
[INFO] 
[INFO] --- maven-checkstyle-plugin:2.6:checkstyle (default-cli) @ hadoop-hdfs-project ---
[INFO] 
[INFO] --- findbugs-maven-plugin:2.3.2:findbugs (default-cli) @ hadoop-hdfs-project ---
[INFO] ****** FindBugsMojo execute *******
[INFO] canGenerate is false
[INFO] ------------------------------------------------------------------------
[INFO] Reactor Summary:
[INFO] 
[INFO] Apache Hadoop HDFS ................................ SUCCESS [3:38.032s]
[INFO] Apache Hadoop HDFS Project ........................ SUCCESS [0.087s]
[INFO] ------------------------------------------------------------------------
[INFO] BUILD SUCCESS
[INFO] ------------------------------------------------------------------------
[INFO] Total time: 3:38.514s
[INFO] Finished at: Mon Sep 26 11:38:07 UTC 2011
[INFO] Final Memory: 60M/762M
[INFO] ------------------------------------------------------------------------
+ /home/jenkins/tools/maven/latest/bin/mvn test -Dmaven.test.failure.ignore=true -Pclover
-DcloverLicenseLocation=/home/jenkins/tools/clover/latest/lib/clover.license
Archiving artifacts
Recording test results
Build step 'Publish JUnit test result report' changed build result to UNSTABLE
Publishing Javadoc
Recording fingerprints
Updating MAPREDUCE-3090
Updating MAPREDUCE-3064
Updating MAPREDUCE-2952
Sending e-mails to: hdfs-dev@hadoop.apache.org
Email was triggered for: Unstable
Sending email for trigger: Unstable



###################################################################################
############################## FAILED TESTS (if any) ##############################
5 tests failed.
REGRESSION:  org.apache.hadoop.hdfs.server.balancer.TestBalancerWithMultipleNameNodes.testBalancer

Error Message:
expected:<1> but was:<-2>

Stack Trace:
java.lang.AssertionError: expected:<1> but was:<-2>
	at org.junit.Assert.fail(Assert.java:91)
	at org.junit.Assert.failNotEquals(Assert.java:645)
	at org.junit.Assert.assertEquals(Assert.java:126)
	at org.junit.Assert.assertEquals(Assert.java:470)
	at org.junit.Assert.assertEquals(Assert.java:454)
	at org.apache.hadoop.hdfs.server.balancer.TestBalancerWithMultipleNameNodes.runBalancer(TestBalancerWithMultipleNameNodes.java:163)
	at org.apache.hadoop.hdfs.server.balancer.TestBalancerWithMultipleNameNodes.runTest(TestBalancerWithMultipleNameNodes.java:361)
	at org.apache.hadoop.hdfs.server.balancer.TestBalancerWithMultipleNameNodes.__CLR3_0_27qjdv51a7y(TestBalancerWithMultipleNameNodes.java:375)
	at org.apache.hadoop.hdfs.server.balancer.TestBalancerWithMultipleNameNodes.testBalancer(TestBalancerWithMultipleNameNodes.java:373)
	at sun.reflect.NativeMethodAccessorImpl.invoke0(Native Method)
	at sun.reflect.NativeMethodAccessorImpl.invoke(NativeMethodAccessorImpl.java:39)
	at sun.reflect.DelegatingMethodAccessorImpl.invoke(DelegatingMethodAccessorImpl.java:25)
	at java.lang.reflect.Method.invoke(Method.java:597)
	at org.junit.runners.model.FrameworkMethod$1.runReflectiveCall(FrameworkMethod.java:44)
	at org.junit.internal.runners.model.ReflectiveCallable.run(ReflectiveCallable.java:15)
	at org.junit.runners.model.FrameworkMethod.invokeExplosively(FrameworkMethod.java:41)
	at org.junit.internal.runners.statements.InvokeMethod.evaluate(InvokeMethod.java:20)
	at org.junit.runners.BlockJUnit4ClassRunner.runChild(BlockJUnit4ClassRunner.java:76)
	at org.junit.runners.BlockJUnit4ClassRunner.runChild(BlockJUnit4ClassRunner.java:50)
	at org.junit.runners.ParentRunner$3.run(ParentRunner.java:193)
	at org.junit.runners.ParentRunner$1.schedule(ParentRunner.java:52)
	at org.junit.runners.ParentRunner.runChildren(ParentRunner.java:191)
	at org.junit.runners.ParentRunner.access$000(ParentRunner.java:42)
	at org.junit.runners.ParentRunner$2.evaluate(ParentRunner.java:184)
	at org.junit.runners.ParentRunner.run(ParentRunner.java:236)
	at org.apache.maven.surefire.junit4.JUnit4TestSet.execute(JUnit4TestSet.java:59)
	at org.apache.maven.surefire.suite.AbstractDirectoryTestSuite.executeTestSet(AbstractDirectoryTestSuite.java:120)
	at org.apache.maven.surefire.suite.AbstractDirectoryTestSuite.execute(AbstractDirectoryTestSuite.java:145)
	at org.apache.maven.surefire.Surefire.run(Surefire.java:104)
	at sun.reflect.NativeMethodAccessorImpl.invoke0(Native Method)
	at sun.reflect.NativeMethodAccessorImpl.invoke(NativeMethodAccessorImpl.java:39)
	at sun.reflect.DelegatingMethodAccessorImpl.invoke(DelegatingMethodAccessorImpl.java:25)
	at java.lang.reflect.Method.invoke(Method.java:597)
	at org.apache.maven.surefire.booter.SurefireBooter.runSuitesInProcess(SurefireBooter.java:290)
	at org.apache.maven.surefire.booter.SurefireBooter.main(SurefireBooter.java:1017)


REGRESSION:  org.apache.hadoop.hdfs.server.datanode.TestReplicasMap.testGet

Error Message:


Stack Trace:
java.lang.AssertionError: 
	at org.junit.Assert.fail(Assert.java:91)
	at org.junit.Assert.assertTrue(Assert.java:43)
	at org.junit.Assert.assertNotNull(Assert.java:524)
	at org.junit.Assert.assertNotNull(Assert.java:535)
	at org.apache.hadoop.hdfs.server.datanode.TestReplicasMap.__CLR3_0_2tpje3v1deq(TestReplicasMap.java:50)
	at org.apache.hadoop.hdfs.server.datanode.TestReplicasMap.testGet(TestReplicasMap.java:42)
	at sun.reflect.NativeMethodAccessorImpl.invoke0(Native Method)
	at sun.reflect.NativeMethodAccessorImpl.invoke(NativeMethodAccessorImpl.java:39)
	at sun.reflect.DelegatingMethodAccessorImpl.invoke(DelegatingMethodAccessorImpl.java:25)
	at java.lang.reflect.Method.invoke(Method.java:597)
	at org.junit.runners.model.FrameworkMethod$1.runReflectiveCall(FrameworkMethod.java:44)
	at org.junit.internal.runners.model.ReflectiveCallable.run(ReflectiveCallable.java:15)
	at org.junit.runners.model.FrameworkMethod.invokeExplosively(FrameworkMethod.java:41)
	at org.junit.internal.runners.statements.InvokeMethod.evaluate(InvokeMethod.java:20)
	at org.junit.runners.BlockJUnit4ClassRunner.runChild(BlockJUnit4ClassRunner.java:76)
	at org.junit.runners.BlockJUnit4ClassRunner.runChild(BlockJUnit4ClassRunner.java:50)
	at org.junit.runners.ParentRunner$3.run(ParentRunner.java:193)
	at org.junit.runners.ParentRunner$1.schedule(ParentRunner.java:52)
	at org.junit.runners.ParentRunner.runChildren(ParentRunner.java:191)
	at org.junit.runners.ParentRunner.access$000(ParentRunner.java:42)
	at org.junit.runners.ParentRunner$2.evaluate(ParentRunner.java:184)
	at org.junit.internal.runners.statements.RunBefores.evaluate(RunBefores.java:28)
	at org.junit.runners.ParentRunner.run(ParentRunner.java:236)
	at org.apache.maven.surefire.junit4.JUnit4TestSet.execute(JUnit4TestSet.java:59)
	at org.apache.maven.surefire.suite.AbstractDirectoryTestSuite.executeTestSet(AbstractDirectoryTestSuite.java:120)
	at org.apache.maven.surefire.suite.AbstractDirectoryTestSuite.execute(AbstractDirectoryTestSuite.java:145)
	at org.apache.maven.surefire.Surefire.run(Surefire.java:104)
	at sun.reflect.NativeMethodAccessorImpl.invoke0(Native Method)
	at sun.reflect.NativeMethodAccessorImpl.invoke(NativeMethodAccessorImpl.java:39)
	at sun.reflect.DelegatingMethodAccessorImpl.invoke(DelegatingMethodAccessorImpl.java:25)
	at java.lang.reflect.Method.invoke(Method.java:597)
	at org.apache.maven.surefire.booter.SurefireBooter.runSuitesInProcess(SurefireBooter.java:290)
	at org.apache.maven.surefire.booter.SurefireBooter.main(SurefireBooter.java:1017)


FAILED:  org.apache.hadoop.hdfs.TestDfsOverAvroRpc.testWorkingDirectory

Error Message:
Two methods with same name: delete

Stack Trace:
org.apache.avro.AvroTypeException: Two methods with same name: delete
	at org.apache.avro.reflect.ReflectData.getProtocol(ReflectData.java:394)
	at org.apache.avro.ipc.reflect.ReflectResponder.<init>(ReflectResponder.java:36)
	at org.apache.hadoop.ipc.AvroRpcEngine.createResponder(AvroRpcEngine.java:180)
	at org.apache.hadoop.ipc.AvroRpcEngine$TunnelResponder.<init>(AvroRpcEngine.java:187)
	at org.apache.hadoop.ipc.AvroRpcEngine.getServer(AvroRpcEngine.java:223)
	at org.apache.hadoop.ipc.RPC.getServer(RPC.java:570)
	at org.apache.hadoop.hdfs.server.namenode.NameNodeRpcServer.<init>(NameNodeRpcServer.java:146)
	at org.apache.hadoop.hdfs.server.namenode.NameNode.createRpcServer(NameNode.java:355)
	at org.apache.hadoop.hdfs.server.namenode.NameNode.initialize(NameNode.java:333)
	at org.apache.hadoop.hdfs.server.namenode.NameNode.<init>(NameNode.java:457)
	at org.apache.hadoop.hdfs.server.namenode.NameNode.<init>(NameNode.java:449)
	at org.apache.hadoop.hdfs.server.namenode.NameNode.createNameNode(NameNode.java:747)
	at org.apache.hadoop.hdfs.MiniDFSCluster.createNameNode(MiniDFSCluster.java:637)
	at org.apache.hadoop.hdfs.MiniDFSCluster.initMiniDFSCluster(MiniDFSCluster.java:541)
	at org.apache.hadoop.hdfs.MiniDFSCluster.<init>(MiniDFSCluster.java:257)
	at org.apache.hadoop.hdfs.MiniDFSCluster.<init>(MiniDFSCluster.java:85)
	at org.apache.hadoop.hdfs.MiniDFSCluster$Builder.build(MiniDFSCluster.java:243)
	at org.apache.hadoop.hdfs.TestLocalDFS.__CLR3_0_2hl5jzp17hk(TestLocalDFS.java:64)
	at org.apache.hadoop.hdfs.TestLocalDFS.testWorkingDirectory(TestLocalDFS.java:62)
	at org.apache.hadoop.hdfs.TestDfsOverAvroRpc.__CLR3_0_2hl5jzp14p2(TestDfsOverAvroRpc.java:30)
	at org.apache.hadoop.hdfs.TestDfsOverAvroRpc.testWorkingDirectory(TestDfsOverAvroRpc.java:27)
	at sun.reflect.NativeMethodAccessorImpl.invoke0(Native Method)
	at sun.reflect.NativeMethodAccessorImpl.invoke(NativeMethodAccessorImpl.java:39)
	at sun.reflect.DelegatingMethodAccessorImpl.invoke(DelegatingMethodAccessorImpl.java:25)
	at java.lang.reflect.Method.invoke(Method.java:597)
	at junit.framework.TestCase.runTest(TestCase.java:168)
	at junit.framework.TestCase.runBare(TestCase.java:134)
	at junit.framework.TestResult$1.protect(TestResult.java:110)
	at junit.framework.TestResult.runProtected(TestResult.java:128)
	at junit.framework.TestResult.run(TestResult.java:113)
	at junit.framework.TestCase.run(TestCase.java:124)
	at junit.framework.TestSuite.runTest(TestSuite.java:232)
	at junit.framework.TestSuite.run(TestSuite.java:227)
	at org.junit.internal.runners.JUnit38ClassRunner.run(JUnit38ClassRunner.java:83)
	at org.apache.maven.surefire.junit4.JUnit4TestSet.execute(JUnit4TestSet.java:59)
	at org.apache.maven.surefire.suite.AbstractDirectoryTestSuite.executeTestSet(AbstractDirectoryTestSuite.java:120)
	at org.apache.maven.surefire.suite.AbstractDirectoryTestSuite.execute(AbstractDirectoryTestSuite.java:145)
	at org.apache.maven.surefire.Surefire.run(Surefire.java:104)
	at sun.reflect.NativeMethodAccessorImpl.invoke0(Native Method)
	at sun.reflect.NativeMethodAccessorImpl.invoke(NativeMethodAccessorImpl.java:39)
	at sun.reflect.DelegatingMethodAccessorImpl.invoke(DelegatingMethodAccessorImpl.java:25)
	at java.lang.reflect.Method.invoke(Method.java:597)
	at org.apache.maven.surefire.booter.SurefireBooter.runSuitesInProcess(SurefireBooter.java:290)
	at org.apache.maven.surefire.booter.SurefireBooter.main(SurefireBooter.java:1017)


FAILED:  org.apache.hadoop.hdfs.server.blockmanagement.TestHost2NodesMap.testGetDatanodeByHost

Error Message:
null

Stack Trace:
junit.framework.AssertionFailedError: null
	at junit.framework.Assert.fail(Assert.java:47)
	at junit.framework.Assert.assertTrue(Assert.java:20)
	at junit.framework.Assert.assertTrue(Assert.java:27)
	at org.apache.hadoop.hdfs.server.blockmanagement.TestHost2NodesMap.__CLR3_0_2sade1i1awa(TestHost2NodesMap.java:55)
	at org.apache.hadoop.hdfs.server.blockmanagement.TestHost2NodesMap.testGetDatanodeByHost(TestHost2NodesMap.java:54)
	at sun.reflect.NativeMethodAccessorImpl.invoke0(Native Method)
	at sun.reflect.NativeMethodAccessorImpl.invoke(NativeMethodAccessorImpl.java:39)
	at sun.reflect.DelegatingMethodAccessorImpl.invoke(DelegatingMethodAccessorImpl.java:25)
	at java.lang.reflect.Method.invoke(Method.java:597)
	at junit.framework.TestCase.runTest(TestCase.java:168)
	at junit.framework.TestCase.runBare(TestCase.java:134)
	at junit.framework.TestResult$1.protect(TestResult.java:110)
	at junit.framework.TestResult.runProtected(TestResult.java:128)
	at junit.framework.TestResult.run(TestResult.java:113)
	at junit.framework.TestCase.run(TestCase.java:124)
	at junit.framework.TestSuite.runTest(TestSuite.java:232)
	at junit.framework.TestSuite.run(TestSuite.java:227)
	at org.junit.internal.runners.JUnit38ClassRunner.run(JUnit38ClassRunner.java:83)
	at org.apache.maven.surefire.junit4.JUnit4TestSet.execute(JUnit4TestSet.java:59)
	at org.apache.maven.surefire.suite.AbstractDirectoryTestSuite.executeTestSet(AbstractDirectoryTestSuite.java:120)
	at org.apache.maven.surefire.suite.AbstractDirectoryTestSuite.execute(AbstractDirectoryTestSuite.java:145)
	at org.apache.maven.surefire.Surefire.run(Surefire.java:104)
	at sun.reflect.NativeMethodAccessorImpl.invoke0(Native Method)
	at sun.reflect.NativeMethodAccessorImpl.invoke(NativeMethodAccessorImpl.java:39)
	at sun.reflect.DelegatingMethodAccessorImpl.invoke(DelegatingMethodAccessorImpl.java:25)
	at java.lang.reflect.Method.invoke(Method.java:597)
	at org.apache.maven.surefire.booter.SurefireBooter.runSuitesInProcess(SurefireBooter.java:290)
	at org.apache.maven.surefire.booter.SurefireBooter.main(SurefireBooter.java:1017)


FAILED:  org.apache.hadoop.hdfs.server.blockmanagement.TestHost2NodesMap.testGetDatanodeByName

Error Message:
null

Stack Trace:
junit.framework.AssertionFailedError: null
	at junit.framework.Assert.fail(Assert.java:47)
	at junit.framework.Assert.assertTrue(Assert.java:20)
	at junit.framework.Assert.assertTrue(Assert.java:27)
	at org.apache.hadoop.hdfs.server.blockmanagement.TestHost2NodesMap.__CLR3_0_22ai47t1awg(TestHost2NodesMap.java:63)
	at org.apache.hadoop.hdfs.server.blockmanagement.TestHost2NodesMap.testGetDatanodeByName(TestHost2NodesMap.java:62)
	at sun.reflect.NativeMethodAccessorImpl.invoke0(Native Method)
	at sun.reflect.NativeMethodAccessorImpl.invoke(NativeMethodAccessorImpl.java:39)
	at sun.reflect.DelegatingMethodAccessorImpl.invoke(DelegatingMethodAccessorImpl.java:25)
	at java.lang.reflect.Method.invoke(Method.java:597)
	at junit.framework.TestCase.runTest(TestCase.java:168)
	at junit.framework.TestCase.runBare(TestCase.java:134)
	at junit.framework.TestResult$1.protect(TestResult.java:110)
	at junit.framework.TestResult.runProtected(TestResult.java:128)
	at junit.framework.TestResult.run(TestResult.java:113)
	at junit.framework.TestCase.run(TestCase.java:124)
	at junit.framework.TestSuite.runTest(TestSuite.java:232)
	at junit.framework.TestSuite.run(TestSuite.java:227)
	at org.junit.internal.runners.JUnit38ClassRunner.run(JUnit38ClassRunner.java:83)
	at org.apache.maven.surefire.junit4.JUnit4TestSet.execute(JUnit4TestSet.java:59)
	at org.apache.maven.surefire.suite.AbstractDirectoryTestSuite.executeTestSet(AbstractDirectoryTestSuite.java:120)
	at org.apache.maven.surefire.suite.AbstractDirectoryTestSuite.execute(AbstractDirectoryTestSuite.java:145)
	at org.apache.maven.surefire.Surefire.run(Surefire.java:104)
	at sun.reflect.NativeMethodAccessorImpl.invoke0(Native Method)
	at sun.reflect.NativeMethodAccessorImpl.invoke(NativeMethodAccessorImpl.java:39)
	at sun.reflect.DelegatingMethodAccessorImpl.invoke(DelegatingMethodAccessorImpl.java:25)
	at java.lang.reflect.Method.invoke(Method.java:597)
	at org.apache.maven.surefire.booter.SurefireBooter.runSuitesInProcess(SurefireBooter.java:290)
	at org.apache.maven.surefire.booter.SurefireBooter.main(SurefireBooter.java:1017)




Mime
View raw message