hadoop-hdfs-dev mailing list archives

Site index · List index
Message view « Date » · « Thread »
Top « Date » · « Thread »
From Apache Jenkins Server <jenk...@builds.apache.org>
Subject Build failed in Jenkins: Hadoop-Hdfs-0.23-Build #3
Date Tue, 13 Sep 2011 19:09:50 GMT
See <https://builds.apache.org/job/Hadoop-Hdfs-0.23-Build/3/>

------------------------------------------
[...truncated 13021 lines...]
28 KB   13 KB   10 KB   227 KB   
28 KB   13 KB   10 KB   228 KB   
28 KB   13 KB   10 KB   228 KB   
28 KB   13 KB   10 KB   229 KB   
28 KB   13 KB   10 KB   230 KB   
28 KB   13 KB   10 KB   230 KB   
28 KB   13 KB   10 KB   230 KB   
28 KB   13 KB   10 KB   230 KB   
28 KB   13 KB   10 KB   231 KB   
28 KB   13 KB   10 KB   231 KB   
28 KB   13 KB   10 KB   232 KB   
28 KB   13 KB   10 KB   232 KB   
28 KB   13 KB   10 KB   233 KB   
28 KB   13 KB   10 KB   233 KB   
28 KB   13 KB   10 KB   234 KB   
28 KB   13 KB   10 KB   234 KB   
28 KB   13 KB   10 KB   235 KB   
28 KB   13 KB   10 KB   235 KB   
28 KB   13 KB   10 KB   236 KB   
28 KB   13 KB   10 KB   237 KB   
28 KB   13 KB   10 KB   237 KB   
28 KB   13 KB   10 KB   238 KB   
28 KB   13 KB   10 KB   238 KB   
28 KB   13 KB   10 KB   239 KB   
28 KB   13 KB   10 KB   239 KB   
28 KB   13 KB   10 KB   240 KB   
28 KB   13 KB   10 KB   240 KB   
28 KB   13 KB   10 KB   241 KB   
28 KB   13 KB   10 KB   241 KB   
28 KB   13 KB   10 KB   242 KB   
28 KB   13 KB   10 KB   242 KB   
28 KB   13 KB   10 KB   243 KB   
28 KB   13 KB   10 KB   243 KB   
28 KB   13 KB   10 KB   244 KB   
28 KB   13 KB   10 KB   244 KB   
28 KB   13 KB   10 KB   245 KB   
28 KB   13 KB   10 KB   245 KB   
28 KB   13 KB   11 KB   245 KB   
28 KB   13 KB   11 KB   245 KB   
28 KB   13 KB   11 KB   245 KB   
28 KB   13 KB   11 KB   246 KB   
28 KB   13 KB   12 KB   246 KB   
28 KB   13 KB   12 KB   246 KB   
28 KB   13 KB   12 KB   247 KB   
28 KB   13 KB   12 KB   247 KB   
28 KB   13 KB   12 KB   247 KB   
28 KB   13 KB   13 KB   248 KB   
28 KB   13 KB   13 KB   248 KB   
28 KB   13 KB   13 KB   248 KB   
28 KB   13 KB   13 KB   248 KB   
28 KB   13 KB   14 KB   248 KB   
28 KB   13 KB   14 KB   249 KB   
28 KB   13 KB   15 KB   249 KB   
28 KB   13 KB   15 KB   249 KB   
28 KB   13 KB   15 KB   249 KB   
28 KB   13 KB   15 KB   250 KB   
28 KB   13 KB   16 KB   250 KB   
28 KB   13 KB   16 KB   251 KB   
28 KB   13 KB   16 KB   251 KB   
28 KB   13 KB   16 KB   251 KB   
28 KB   13 KB   17 KB   251 KB   
28 KB   13 KB   17 KB   252 KB   
28 KB   13 KB   17 KB   252 KB   
28 KB   13 KB   17 KB   252 KB   
28 KB   13 KB   18 KB   252 KB   
28 KB   13 KB   18 KB   253 KB   
28 KB   13 KB   18 KB   253 KB   
28 KB   13 KB   18 KB   253 KB   
28 KB   13 KB   18 KB   253 KB   
28 KB   13 KB   18 KB   254 KB   
28 KB   13 KB   19 KB   254 KB   
28 KB   13 KB   19 KB   254 KB   
28 KB   13 KB   19 KB   254 KB   
28 KB   13 KB   19 KB   255 KB   
28 KB   13 KB   20 KB   255 KB   
28 KB   13 KB   20 KB   255 KB   
28 KB   13 KB   20 KB   255 KB   
28 KB   13 KB   20 KB   256 KB   
28 KB   13 KB   21 KB   256 KB   
28 KB   13 KB   21 KB   257 KB   
28 KB   13 KB   21 KB   257 KB   
28 KB   13 KB   21 KB   257 KB   
28 KB   13 KB   22 KB   257 KB   
28 KB   13 KB   22 KB   258 KB   
28 KB   13 KB   22 KB   258 KB   
28 KB   13 KB   22 KB   258 KB   
28 KB   13 KB   22 KB   259 KB   
28 KB   13 KB   22 KB   259 KB   
28 KB   13 KB   22 KB   260 KB   
28 KB   13 KB   22 KB   260 KB   
28 KB   13 KB   22 KB   261 KB   
28 KB   13 KB   22 KB   261 KB   
28 KB   13 KB   22 KB   262 KB   
28 KB   13 KB   22 KB   262 KB   
28 KB   13 KB   22 KB   263 KB   
28 KB   13 KB   22 KB   264 KB   
28 KB   13 KB   22 KB   264 KB   
28 KB   13 KB   22 KB   265 KB   
28 KB   13 KB   22 KB   265 KB   
28 KB   13 KB   22 KB   266 KB   
28 KB   13 KB   22 KB   266 KB   
28 KB   13 KB   22 KB   267 KB   
28 KB   13 KB   22 KB   267 KB   
28 KB   13 KB   22 KB   268 KB   
28 KB   13 KB   22 KB   269 KB   
28 KB   13 KB   22 KB   269 KB   
28 KB   13 KB   22 KB   270 KB   
28 KB   13 KB   22 KB   270 KB   
28 KB   13 KB   22 KB   271 KB   
28 KB   13 KB   22 KB   271 KB   
28 KB   13 KB   22 KB   272 KB   
28 KB   13 KB   22 KB   272 KB   
28 KB   13 KB   22 KB   273 KB   
28 KB   13 KB   22 KB   273 KB   
28 KB   13 KB   22 KB   273 KB   
28 KB   13 KB   22 KB   274 KB   
28 KB   13 KB   22 KB   274 KB   
28 KB   13 KB   22 KB   275 KB   
28 KB   13 KB   22 KB   276 KB   
28 KB   13 KB   22 KB   276 KB   
28 KB   13 KB   22 KB   277 KB   
28 KB   13 KB   22 KB   277 KB   
28 KB   13 KB   22 KB   278 KB   
28 KB   13 KB   22 KB   278 KB   
28 KB   13 KB   22 KB   279 KB   
28 KB   13 KB   22 KB   279 KB   
28 KB   13 KB   22 KB   280 KB   
28 KB   13 KB   22 KB   280 KB   
28 KB   13 KB   22 KB   281 KB   
28 KB   13 KB   22 KB   282 KB   
28 KB   13 KB   22 KB   282 KB   
28 KB   13 KB   22 KB   282 KB   
28 KB   13 KB   22 KB   283 KB   
28 KB   13 KB   22 KB   283 KB   
28 KB   13 KB   22 KB   284 KB   
28 KB   13 KB   22 KB   284 KB   
28 KB   13 KB   22 KB   285 KB   
28 KB   13 KB   22 KB   285 KB   
28 KB   13 KB   22 KB   286 KB   
28 KB   13 KB   22 KB   286 KB   
28 KB   13 KB   22 KB   287 KB   
28 KB   13 KB   22 KB   287 KB   
28 KB   13 KB   22 KB   288 KB   
28 KB   13 KB   22 KB   289 KB   
28 KB   13 KB   22 KB   289 KB   
28 KB   13 KB   22 KB   290 KB   
28 KB   13 KB   22 KB   290 KB   
28 KB   13 KB   22 KB   291 KB   
28 KB   13 KB   22 KB   291 KB   
28 KB   13 KB   22 KB   292 KB   
28 KB   13 KB   22 KB   292 KB   
28 KB   13 KB   22 KB   293 KB   
28 KB   13 KB   22 KB   293 KB   
28 KB   13 KB   22 KB   294 KB   
28 KB   13 KB   22 KB   294 KB   
28 KB   13 KB   22 KB   295 KB   
28 KB   13 KB   22 KB   295 KB   
28 KB   13 KB   22 KB   296 KB   
28 KB   13 KB   22 KB   297 KB   
28 KB   13 KB   22 KB   300 KB   
28 KB   13 KB   22 KB   302 KB   
28 KB   13 KB   22 KB   305 KB   
28 KB   13 KB   22 KB   308 KB   
28 KB   13 KB   22 KB   311 KB   
28 KB   13 KB   22 KB   313 KB   
28 KB   13 KB   22 KB   316 KB   
28 KB   13 KB   22 KB   319 KB   
28 KB   13 KB   22 KB   321 KB   
28 KB   13 KB   22 KB   324 KB   
28 KB   13 KB   22 KB   324 KB   
28 KB   13 KB   22 KB   324 KB   
28 KB   13 KB   23 KB   324 KB   
28 KB   13 KB   23 KB   324 KB   
28 KB   13 KB   24 KB   324 KB   
28 KB   13 KB   24 KB   324 KB   
28 KB   13 KB   25 KB   324 KB   
28 KB   13 KB   26 KB   324 KB   
28 KB   13 KB   26 KB   324 KB   
28 KB   13 KB   27 KB   324 KB   
28 KB   13 KB   27 KB   324 KB   
28 KB   13 KB   28 KB   324 KB   
28 KB   13 KB   28 KB   324 KB   
28 KB   13 KB   29 KB   324 KB   
28 KB   13 KB   29 KB   324 KB   
28 KB   13 KB   30 KB   324 KB   
28 KB   13 KB   30 KB   324 KB   
28 KB   13 KB   31 KB   324 KB   
28 KB   13 KB   31 KB   324 KB   
28 KB   13 KB   32 KB   324 KB   
28 KB   13 KB   32 KB   324 KB   
28 KB   13 KB   33 KB   324 KB   
28 KB   13 KB   34 KB   324 KB   
28 KB   13 KB   34 KB   324 KB   
28 KB   13 KB   35 KB   324 KB   
28 KB   13 KB   35 KB   324 KB   
28 KB   13 KB   36 KB   324 KB   
28 KB   13 KB   36 KB   324 KB   
28 KB   13 KB   37 KB   324 KB   
28 KB   13 KB   37 KB   324 KB   
28 KB   13 KB   38 KB   324 KB   
28 KB   13 KB   38 KB   324 KB   
28 KB   13 KB   39 KB   324 KB   
28 KB   13 KB   39 KB   324 KB   
28 KB   13 KB   40 KB   324 KB   
28 KB   13 KB   40 KB   324 KB   
28 KB   13 KB   41 KB   324 KB   
28 KB   13 KB   41 KB   324 KB   
28 KB   13 KB   42 KB   324 KB   
28 KB   13 KB   42 KB   324 KB   
28 KB   13 KB   43 KB   324 KB   
28 KB   13 KB   43 KB   324 KB   
28 KB   13 KB   44 KB   324 KB   
28 KB   13 KB   44 KB   324 KB   
28 KB   13 KB   46 KB   324 KB   
28 KB   13 KB   50 KB   324 KB   
28 KB   13 KB   50 KB   324 KB   
                                 
Downloaded: http://repo1.maven.org/maven2/org/sonatype/plexus/plexus-sec-dispatcher/1.1/plexus-sec-dispatcher-1.1.jar
(28 KB at 12.4 KB/sec)
                                 
Downloaded: http://repo1.maven.org/maven2/org/sonatype/plexus/plexus-cipher/1.1/plexus-cipher-1.1.jar
(13 KB at 5.6 KB/sec)
                                 
Downloaded: http://repo1.maven.org/maven2/backport-util-concurrent/backport-util-concurrent/3.1/backport-util-concurrent-3.1.jar
(324 KB at 143.9 KB/sec)
                                 
Downloaded: http://repo1.maven.org/maven2/org/codehaus/plexus/plexus-interpolation/1.8.1/plexus-interpolation-1.8.1.jar
(50 KB at 21.5 KB/sec)
[INFO] ------------------------------------------------------------------------
[INFO] Reactor Summary:
[INFO] 
[INFO] Apache Hadoop HDFS ................................ FAILURE [30.405s]
[INFO] Apache Hadoop HDFS Project ........................ SKIPPED
[INFO] ------------------------------------------------------------------------
[INFO] BUILD FAILURE
[INFO] ------------------------------------------------------------------------
[INFO] Total time: 30.851s
[INFO] Finished at: Tue Sep 13 19:09:49 UTC 2011
[INFO] Final Memory: 28M/266M
[INFO] ------------------------------------------------------------------------
[ERROR] Failed to execute goal org.codehaus.mojo:make-maven-plugin:1.0-beta-1:autoreconf (compile)
on project hadoop-hdfs: autoreconf command returned an exit value != 0. Aborting build; see
debug output for more information. -> [Help 1]
[ERROR] 
[ERROR] To see the full stack trace of the errors, re-run Maven with the -e switch.
[ERROR] Re-run Maven using the -X switch to enable full debug logging.
[ERROR] 
[ERROR] For more information about the errors and possible solutions, please read the following
articles:
[ERROR] [Help 1] http://cwiki.apache.org/confluence/display/MAVEN/MojoExecutionException
Build step 'Execute shell' marked build as failure
[WARNINGS] Skipping publisher since build result is FAILURE
Archiving artifacts
Recording test results
Publishing Javadoc
Recording fingerprints


Mime
View raw message