hadoop-hdfs-dev mailing list archives

Site index · List index
Message view « Date » · « Thread »
Top « Date » · « Thread »
From Apache Jenkins Server <jenk...@builds.apache.org>
Subject Hadoop-Hdfs-22-branch - Build # 91 - Still Failing
Date Wed, 28 Sep 2011 03:02:35 GMT
See https://builds.apache.org/job/Hadoop-Hdfs-22-branch/91/

###################################################################################
########################## LAST 60 LINES OF THE CONSOLE ###########################
[...truncated 2109 lines...]

-compile-test-system.wrapper:
    [mkdir] Created dir: /home/jenkins/jenkins-slave/workspace/Hadoop-Hdfs-22-branch/trunk/build-fi/system/test/classes
    [javac] Compiling 1 source file to /home/jenkins/jenkins-slave/workspace/Hadoop-Hdfs-22-branch/trunk/build-fi/system/test/classes

jar-test-system:

-do-jar-test:
      [jar] Building jar: /home/jenkins/jenkins-slave/workspace/Hadoop-Hdfs-22-branch/trunk/build-fi/system/hadoop-hdfs-instrumented-test-0.22.0-SNAPSHOT.jar
      [jar] Building jar: /home/jenkins/jenkins-slave/workspace/Hadoop-Hdfs-22-branch/trunk/build-fi/system/hadoop-hdfs-instrumented-test-0.22.0-SNAPSHOT-sources.jar

set-version:
     [copy] Copying 1 file to /home/jenkins/jenkins-slave/workspace/Hadoop-Hdfs-22-branch/trunk/ivy
     [copy] Copying 1 file to /home/jenkins/jenkins-slave/workspace/Hadoop-Hdfs-22-branch/trunk/ivy
     [copy] Copying 1 file to /home/jenkins/jenkins-slave/workspace/Hadoop-Hdfs-22-branch/trunk/ivy
     [copy] Copying 1 file to /home/jenkins/jenkins-slave/workspace/Hadoop-Hdfs-22-branch/trunk/ivy

clean-sign:

sign:

signanddeploy:

simpledeploy:
[artifact:install-provider] Installing provider: org.apache.maven.wagon:wagon-http:jar:1.0-beta-2:runtime
[artifact:deploy] Deploying to https://repository.apache.org/content/repositories/snapshots
[artifact:deploy] [INFO] Retrieving previous build number from apache.snapshots.https
[artifact:deploy] Uploading: org/apache/hadoop/hadoop-hdfs/0.22.0-SNAPSHOT/hadoop-hdfs-0.22.0-20110928.030018-385.jar
to apache.snapshots.https
[artifact:deploy] Uploaded 1025K
[artifact:deploy] An error has occurred while processing the Maven artifact tasks.
[artifact:deploy]  Diagnosis:
[artifact:deploy] 
[artifact:deploy] Error deploying artifact 'org.apache.hadoop:hadoop-hdfs:jar': Error deploying
artifact: Failed to transfer file: https://repository.apache.org/content/repositories/snapshots/org/apache/hadoop/hadoop-hdfs/0.22.0-SNAPSHOT/hadoop-hdfs-0.22.0-20110928.030018-385.jar.
Return code is: 401

BUILD FAILED
/home/jenkins/jenkins-slave/workspace/Hadoop-Hdfs-22-branch/trunk/build.xml:1706: Error deploying
artifact 'org.apache.hadoop:hadoop-hdfs:jar': Error deploying artifact: Failed to transfer
file: https://repository.apache.org/content/repositories/snapshots/org/apache/hadoop/hadoop-hdfs/0.22.0-SNAPSHOT/hadoop-hdfs-0.22.0-20110928.030018-385.jar.
Return code is: 401

Total time: 1 minute 24 seconds


======================================================================
======================================================================
STORE: saving artifacts
======================================================================
======================================================================


mv: cannot stat `build/test/findbugs': No such file or directory
Build Failed
Build step 'Execute shell' marked build as failure
[FINDBUGS] Skipping publisher since build result is FAILURE
Archiving artifacts
Publishing Clover coverage report...
No Clover report will be published due to a Build Failure
Recording test results
Publishing Javadoc
Recording fingerprints
Email was triggered for: Failure
Sending email for trigger: Failure



###################################################################################
############################## FAILED TESTS (if any) ##############################
No tests ran.

Mime
View raw message