hadoop-hdfs-dev mailing list archives

Site index · List index
Message view « Date » · « Thread »
Top « Date » · « Thread »
From Apache Jenkins Server <jenk...@builds.apache.org>
Subject Build failed in Jenkins: Hadoop-Hdfs-trunk #795
Date Tue, 13 Sep 2011 18:23:20 GMT
See <https://builds.apache.org/job/Hadoop-Hdfs-trunk/795/>

------------------------------------------
[...truncated 6690 lines...]
[INFO] --- build-helper-maven-plugin:1.5:add-source (add-source) @ hadoop-hdfs ---
[INFO] Source directory: <https://builds.apache.org/job/Hadoop-Hdfs-trunk/ws/trunk/hadoop-hdfs-project/hadoop-hdfs/target/generated-src/main/jsp>
added.
[INFO] 
[INFO] <<< maven-source-plugin:2.1.2:jar (default) @ hadoop-hdfs <<<
[INFO] 
[INFO] --- maven-source-plugin:2.1.2:jar (default) @ hadoop-hdfs ---
[INFO] org already added, skipping
[INFO] org/apache already added, skipping
[INFO] org/apache/hadoop already added, skipping
[INFO] org/apache/hadoop/hdfs already added, skipping
[INFO] org/apache/hadoop/hdfs/server already added, skipping
[INFO] org/apache/hadoop/hdfs/server/datanode already added, skipping
[INFO] org/apache/hadoop/hdfs/server/namenode already added, skipping
[INFO] Building jar: <https://builds.apache.org/job/Hadoop-Hdfs-trunk/ws/trunk/hadoop-hdfs-project/hadoop-hdfs/target/hadoop-hdfs-0.24.0-SNAPSHOT-sources.jar>
[INFO] org already added, skipping
[INFO] org/apache already added, skipping
[INFO] org/apache/hadoop already added, skipping
[INFO] org/apache/hadoop/hdfs already added, skipping
[INFO] org/apache/hadoop/hdfs/server already added, skipping
[INFO] org/apache/hadoop/hdfs/server/datanode already added, skipping
[INFO] org/apache/hadoop/hdfs/server/namenode already added, skipping
[INFO] 
[INFO] >>> maven-source-plugin:2.1.2:test-jar (default) @ hadoop-hdfs >>>
[INFO] 
[INFO] --- jspc-maven-plugin:2.0-alpha-3:compile (hdfs) @ hadoop-hdfs ---
[WARNING] Compiled JSPs will not be added to the project and web.xml will not be modified,
either because includeInProject is set to false or because the project's packaging is not
'war'.
[INFO] Compiling 8 JSP source files to <https://builds.apache.org/job/Hadoop-Hdfs-trunk/ws/trunk/hadoop-hdfs-project/hadoop-hdfs/target/generated-src/main/jsp>
WARN: The method class org.apache.commons.logging.impl.SLF4JLogFactory#release() was invoked.
WARN: Please see http://www.slf4j.org/codes.html for an explanation.
[INFO] Compiled completed in 0:00:00.034
[INFO] 
[INFO] --- jspc-maven-plugin:2.0-alpha-3:compile (secondary) @ hadoop-hdfs ---
[WARNING] Compiled JSPs will not be added to the project and web.xml will not be modified,
either because includeInProject is set to false or because the project's packaging is not
'war'.
[INFO] Compiling 1 JSP source file to <https://builds.apache.org/job/Hadoop-Hdfs-trunk/ws/trunk/hadoop-hdfs-project/hadoop-hdfs/target/generated-src/main/jsp>
WARN: The method class org.apache.commons.logging.impl.SLF4JLogFactory#release() was invoked.
WARN: Please see http://www.slf4j.org/codes.html for an explanation.
[INFO] Compiled completed in 0:00:00.010
[INFO] 
[INFO] --- jspc-maven-plugin:2.0-alpha-3:compile (datanode) @ hadoop-hdfs ---
[WARNING] Compiled JSPs will not be added to the project and web.xml will not be modified,
either because includeInProject is set to false or because the project's packaging is not
'war'.
[INFO] Compiling 3 JSP source files to <https://builds.apache.org/job/Hadoop-Hdfs-trunk/ws/trunk/hadoop-hdfs-project/hadoop-hdfs/target/generated-src/main/jsp>
WARN: The method class org.apache.commons.logging.impl.SLF4JLogFactory#release() was invoked.
WARN: Please see http://www.slf4j.org/codes.html for an explanation.
[INFO] Compiled completed in 0:00:00.010
[INFO] 
[INFO] --- build-helper-maven-plugin:1.5:add-source (add-source) @ hadoop-hdfs ---
[INFO] Source directory: <https://builds.apache.org/job/Hadoop-Hdfs-trunk/ws/trunk/hadoop-hdfs-project/hadoop-hdfs/target/generated-src/main/jsp>
added.
[INFO] 
[INFO] <<< maven-source-plugin:2.1.2:test-jar (default) @ hadoop-hdfs <<<
[INFO] 
[INFO] --- maven-source-plugin:2.1.2:test-jar (default) @ hadoop-hdfs ---
[INFO] Building jar: <https://builds.apache.org/job/Hadoop-Hdfs-trunk/ws/trunk/hadoop-hdfs-project/hadoop-hdfs/target/hadoop-hdfs-0.24.0-SNAPSHOT-test-sources.jar>
[INFO] 
[INFO] --- maven-antrun-plugin:1.6:run (xprepare-package-hadoop-daemon) @ hadoop-hdfs ---
[INFO] Executing tasks

main:
    [mkdir] Created dir: <https://builds.apache.org/job/Hadoop-Hdfs-trunk/ws/trunk/hadoop-hdfs-project/hadoop-hdfs/target/downloads/commons-daemon>
      [get] Getting: http://archive.apache.org/dist/commons/daemon/binaries/1.0.3/linux/commons-daemon-1.0.3-bin-linux-i686.tar.gz
      [get] To: <https://builds.apache.org/job/Hadoop-Hdfs-trunk/ws/trunk/hadoop-hdfs-project/hadoop-hdfs/target/downloads/commons-daemon/commons-daemon-1.0.3-bin-linux-i686.tar.gz>
..
    [untar] Expanding: <https://builds.apache.org/job/Hadoop-Hdfs-trunk/ws/trunk/hadoop-hdfs-project/hadoop-hdfs/target/downloads/commons-daemon/commons-daemon-1.0.3-bin-linux-i686.tar.gz>
into <https://builds.apache.org/job/Hadoop-Hdfs-trunk/ws/trunk/hadoop-hdfs-project/hadoop-hdfs/target/downloads/commons-daemon>
     [copy] Copying 1 file to <https://builds.apache.org/job/Hadoop-Hdfs-trunk/ws/trunk/hadoop-hdfs-project/hadoop-hdfs/target/hadoop-hdfs-0.24.0-SNAPSHOT/libexec>
     [copy] Copying <https://builds.apache.org/job/Hadoop-Hdfs-trunk/ws/trunk/hadoop-hdfs-project/hadoop-hdfs/target/downloads/commons-daemon/jsvc>
to <https://builds.apache.org/job/Hadoop-Hdfs-trunk/ws/trunk/hadoop-hdfs-project/hadoop-hdfs/target/hadoop-hdfs-0.24.0-SNAPSHOT/libexec/jsvc>
[INFO] Executed tasks
[INFO] 
[INFO] --- maven-jar-plugin:2.3.1:jar (default-jar) @ hadoop-hdfs ---
[INFO] 
[INFO] --- maven-install-plugin:2.3.1:install (default-install) @ hadoop-hdfs ---
[INFO] Installing <https://builds.apache.org/job/Hadoop-Hdfs-trunk/ws/trunk/hadoop-hdfs-project/hadoop-hdfs/target/hadoop-hdfs-0.24.0-SNAPSHOT.jar>
to /home/jenkins/.m2/repository/org/apache/hadoop/hadoop-hdfs/0.24.0-SNAPSHOT/hadoop-hdfs-0.24.0-SNAPSHOT.jar
[INFO] Installing <https://builds.apache.org/job/Hadoop-Hdfs-trunk/ws/trunk/hadoop-hdfs-project/hadoop-hdfs/pom.xml>
to /home/jenkins/.m2/repository/org/apache/hadoop/hadoop-hdfs/0.24.0-SNAPSHOT/hadoop-hdfs-0.24.0-SNAPSHOT.pom
[INFO] Installing <https://builds.apache.org/job/Hadoop-Hdfs-trunk/ws/trunk/hadoop-hdfs-project/hadoop-hdfs/target/hadoop-hdfs-0.24.0-SNAPSHOT-tests.jar>
to /home/jenkins/.m2/repository/org/apache/hadoop/hadoop-hdfs/0.24.0-SNAPSHOT/hadoop-hdfs-0.24.0-SNAPSHOT-tests.jar
[INFO] Installing <https://builds.apache.org/job/Hadoop-Hdfs-trunk/ws/trunk/hadoop-hdfs-project/hadoop-hdfs/target/hadoop-hdfs-0.24.0-SNAPSHOT-sources.jar>
to /home/jenkins/.m2/repository/org/apache/hadoop/hadoop-hdfs/0.24.0-SNAPSHOT/hadoop-hdfs-0.24.0-SNAPSHOT-sources.jar
[INFO] Installing <https://builds.apache.org/job/Hadoop-Hdfs-trunk/ws/trunk/hadoop-hdfs-project/hadoop-hdfs/target/hadoop-hdfs-0.24.0-SNAPSHOT-test-sources.jar>
to /home/jenkins/.m2/repository/org/apache/hadoop/hadoop-hdfs/0.24.0-SNAPSHOT/hadoop-hdfs-0.24.0-SNAPSHOT-test-sources.jar
[INFO]                                                                         
[INFO] ------------------------------------------------------------------------
[INFO] Building Apache Hadoop HDFS Project 0.24.0-SNAPSHOT
[INFO] ------------------------------------------------------------------------
[INFO] 
[INFO] --- maven-clean-plugin:2.4.1:clean (default-clean) @ hadoop-hdfs-project ---
[INFO] 
[INFO] --- maven-install-plugin:2.3.1:install (default-install) @ hadoop-hdfs-project ---
[INFO] Installing <https://builds.apache.org/job/Hadoop-Hdfs-trunk/ws/trunk/hadoop-hdfs-project/pom.xml>
to /home/jenkins/.m2/repository/org/apache/hadoop/hadoop-hdfs-project/0.24.0-SNAPSHOT/hadoop-hdfs-project-0.24.0-SNAPSHOT.pom
[INFO]                                                                         
[INFO] ------------------------------------------------------------------------
[INFO] Building hadoop-yarn-api 0.24.0-SNAPSHOT
[INFO] ------------------------------------------------------------------------
[INFO] 
[INFO] --- maven-clean-plugin:2.4.1:clean (default-clean) @ hadoop-yarn-api ---
[INFO] 
[INFO] --- maven-antrun-plugin:1.6:run (create-protobuf-generated-sources-directory) @ hadoop-yarn-api
---
[INFO] Executing tasks

main:
    [mkdir] Created dir: <https://builds.apache.org/job/Hadoop-Hdfs-trunk/ws/trunk/hadoop-mapreduce-project/hadoop-yarn/hadoop-yarn-api/target/generated-sources/proto>
[INFO] Executed tasks
[INFO] 
[INFO] --- exec-maven-plugin:1.2:exec (generate-sources) @ hadoop-yarn-api ---
yarn_protos.proto:21:8: Option "java_generic_services" unknown.
[INFO] ------------------------------------------------------------------------
[INFO] Reactor Summary:
[INFO] 
[INFO] Apache Hadoop Project POM ......................... SUCCESS [0.613s]
[INFO] Apache Hadoop Annotations ......................... SUCCESS [1.213s]
[INFO] Apache Hadoop Project Dist POM .................... SUCCESS [0.155s]
[INFO] Apache Hadoop Assemblies .......................... SUCCESS [0.085s]
[INFO] Apache Hadoop Auth ................................ SUCCESS [1.944s]
[INFO] Apache Hadoop Auth Examples ....................... SUCCESS [0.972s]
[INFO] Apache Hadoop Common .............................. SUCCESS [23.179s]
[INFO] Apache Hadoop Common Project ...................... SUCCESS [0.004s]
[INFO] Apache Hadoop HDFS ................................ SUCCESS [16.187s]
[INFO] Apache Hadoop HDFS Project ........................ SUCCESS [0.004s]
[INFO] hadoop-yarn-api ................................... FAILURE [0.313s]
[INFO] hadoop-yarn-common ................................ SKIPPED
[INFO] hadoop-yarn-server-common ......................... SKIPPED
[INFO] hadoop-yarn-server-nodemanager .................... SKIPPED
[INFO] hadoop-yarn-server-resourcemanager ................ SKIPPED
[INFO] hadoop-yarn-server-tests .......................... SKIPPED
[INFO] hadoop-yarn-server ................................ SKIPPED
[INFO] hadoop-yarn ....................................... SKIPPED
[INFO] hadoop-mapreduce-client-core ...................... SKIPPED
[INFO] hadoop-mapreduce-client-common .................... SKIPPED
[INFO] hadoop-mapreduce-client-shuffle ................... SKIPPED
[INFO] hadoop-mapreduce-client-app ....................... SKIPPED
[INFO] hadoop-mapreduce-client-hs ........................ SKIPPED
[INFO] hadoop-mapreduce-client-jobclient ................. SKIPPED
[INFO] hadoop-mapreduce-client ........................... SKIPPED
[INFO] hadoop-mapreduce .................................. SKIPPED
[INFO] Apache Hadoop Main ................................ SKIPPED
[INFO] ------------------------------------------------------------------------
[INFO] BUILD FAILURE
[INFO] ------------------------------------------------------------------------
[INFO] Total time: 45.274s
[INFO] Finished at: Tue Sep 13 18:23:06 UTC 2011
[INFO] Final Memory: 63M/729M
[INFO] ------------------------------------------------------------------------
[ERROR] Failed to execute goal org.codehaus.mojo:exec-maven-plugin:1.2:exec (generate-sources)
on project hadoop-yarn-api: Command execution failed. Process exited with an error: 1(Exit
value: 1) -> [Help 1]
[ERROR] 
[ERROR] To see the full stack trace of the errors, re-run Maven with the -e switch.
[ERROR] Re-run Maven using the -X switch to enable full debug logging.
[ERROR] 
[ERROR] For more information about the errors and possible solutions, please read the following
articles:
[ERROR] [Help 1] http://cwiki.apache.org/confluence/display/MAVEN/MojoExecutionException
[ERROR] 
[ERROR] After correcting the problems, you can resume the build with the command
[ERROR]   mvn <goals> -rf :hadoop-yarn-api
+ cd hadoop-hdfs-project
+ /home/jenkins/tools/maven/latest/bin/mvn clean verify checkstyle:checkstyle findbugs:findbugs
-DskipTests -Pdist -Dtar -Psrc -Pnative -Pdocs
[INFO] Scanning for projects...
[WARNING] 
[WARNING] Some problems were encountered while building the effective model for org.apache.hadoop:hadoop-hdfs:jar:0.24.0-SNAPSHOT
[WARNING] 'build.plugins.plugin.(groupId:artifactId)' must be unique but found duplicate declaration
of plugin org.apache.maven.plugins:maven-antrun-plugin @ line 302, column 15
[WARNING] 
[WARNING] It is highly recommended to fix these problems because they threaten the stability
of your build.
[WARNING] 
[WARNING] For this reason, future Maven versions might no longer support building such malformed
projects.
[WARNING] 
[INFO] ------------------------------------------------------------------------
[INFO] Reactor Build Order:
[INFO] 
[INFO] Apache Hadoop HDFS
[INFO] Apache Hadoop HDFS Project
[INFO]                                                                         
[INFO] ------------------------------------------------------------------------
[INFO] Building Apache Hadoop HDFS 0.24.0-SNAPSHOT
[INFO] ------------------------------------------------------------------------
[INFO] 
[INFO] --- maven-clean-plugin:2.4.1:clean (default-clean) @ hadoop-hdfs ---
[INFO] Deleting <https://builds.apache.org/job/Hadoop-Hdfs-trunk/ws/trunk/hadoop-hdfs-project/hadoop-hdfs/target>
[INFO] 
[INFO] --- jspc-maven-plugin:2.0-alpha-3:compile (hdfs) @ hadoop-hdfs ---
[WARNING] Compiled JSPs will not be added to the project and web.xml will not be modified,
either because includeInProject is set to false or because the project's packaging is not
'war'.
Created dir: <https://builds.apache.org/job/Hadoop-Hdfs-trunk/ws/trunk/hadoop-hdfs-project/hadoop-hdfs/target/generated-src/main/jsp>
Created dir: <https://builds.apache.org/job/Hadoop-Hdfs-trunk/ws/trunk/hadoop-hdfs-project/hadoop-hdfs/target/classes>
[INFO] Compiling 8 JSP source files to <https://builds.apache.org/job/Hadoop-Hdfs-trunk/ws/trunk/hadoop-hdfs-project/hadoop-hdfs/target/generated-src/main/jsp>
log4j:WARN No appenders could be found for logger (org.apache.jasper.JspC).
log4j:WARN Please initialize the log4j system properly.
WARN: The method class org.apache.commons.logging.impl.SLF4JLogFactory#release() was invoked.
WARN: Please see http://www.slf4j.org/codes.html for an explanation.
[INFO] Compiled completed in 0:00:00.256
[INFO] 
[INFO] --- jspc-maven-plugin:2.0-alpha-3:compile (secondary) @ hadoop-hdfs ---
[WARNING] Compiled JSPs will not be added to the project and web.xml will not be modified,
either because includeInProject is set to false or because the project's packaging is not
'war'.
[INFO] Compiling 1 JSP source file to <https://builds.apache.org/job/Hadoop-Hdfs-trunk/ws/trunk/hadoop-hdfs-project/hadoop-hdfs/target/generated-src/main/jsp>
WARN: The method class org.apache.commons.logging.impl.SLF4JLogFactory#release() was invoked.
WARN: Please see http://www.slf4j.org/codes.html for an explanation.
[INFO] Compiled completed in 0:00:00.017
[INFO] 
[INFO] --- jspc-maven-plugin:2.0-alpha-3:compile (datanode) @ hadoop-hdfs ---
[WARNING] Compiled JSPs will not be added to the project and web.xml will not be modified,
either because includeInProject is set to false or because the project's packaging is not
'war'.
[INFO] Compiling 3 JSP source files to <https://builds.apache.org/job/Hadoop-Hdfs-trunk/ws/trunk/hadoop-hdfs-project/hadoop-hdfs/target/generated-src/main/jsp>
WARN: The method class org.apache.commons.logging.impl.SLF4JLogFactory#release() was invoked.
WARN: Please see http://www.slf4j.org/codes.html for an explanation.
[INFO] Compiled completed in 0:00:00.026
[INFO] 
[INFO] --- build-helper-maven-plugin:1.5:add-source (add-source) @ hadoop-hdfs ---
[INFO] Source directory: <https://builds.apache.org/job/Hadoop-Hdfs-trunk/ws/trunk/hadoop-hdfs-project/hadoop-hdfs/target/generated-src/main/jsp>
added.
[INFO] 
[INFO] --- maven-resources-plugin:2.4.3:resources (default-resources) @ hadoop-hdfs ---
[INFO] Using 'UTF-8' encoding to copy filtered resources.
[INFO] Copying 1 resource
[INFO] 
[INFO] --- maven-compiler-plugin:2.3.2:compile (default-compile) @ hadoop-hdfs ---
[INFO] Compiling 322 source files to <https://builds.apache.org/job/Hadoop-Hdfs-trunk/ws/trunk/hadoop-hdfs-project/hadoop-hdfs/target/classes>
[INFO] 
[INFO] --- maven-antrun-plugin:1.6:run (create-web-xmls) @ hadoop-hdfs ---
[INFO] Executing tasks

main:
     [copy] Copying 1 file to <https://builds.apache.org/job/Hadoop-Hdfs-trunk/ws/trunk/hadoop-hdfs-project/hadoop-hdfs/target/webapps/hdfs/WEB-INF>
     [copy] Copying 1 file to <https://builds.apache.org/job/Hadoop-Hdfs-trunk/ws/trunk/hadoop-hdfs-project/hadoop-hdfs/target/webapps/secondary/WEB-INF>
     [copy] Copying 1 file to <https://builds.apache.org/job/Hadoop-Hdfs-trunk/ws/trunk/hadoop-hdfs-project/hadoop-hdfs/target/webapps/datanode/WEB-INF>
     [copy] Copying 6 files to <https://builds.apache.org/job/Hadoop-Hdfs-trunk/ws/trunk/hadoop-hdfs-project/hadoop-hdfs/target/webapps>
[INFO] Executed tasks
[INFO] 
[INFO] --- maven-antrun-plugin:1.6:run (compile) @ hadoop-hdfs ---
[INFO] Executing tasks

main:
     [copy] Copying 15 files to <https://builds.apache.org/job/Hadoop-Hdfs-trunk/ws/trunk/hadoop-hdfs-project/hadoop-hdfs/target/native>
     [copy] Copied 6 empty directories to 2 empty directories under <https://builds.apache.org/job/Hadoop-Hdfs-trunk/ws/trunk/hadoop-hdfs-project/hadoop-hdfs/target/native>
[INFO] Executed tasks
[INFO] 
[INFO] --- make-maven-plugin:1.0-beta-1:autoreconf (compile) @ hadoop-hdfs ---
[INFO] ------------------------------------------------------------------------
[INFO] Reactor Summary:
[INFO] 
[INFO] Apache Hadoop HDFS ................................ FAILURE [10.667s]
[INFO] Apache Hadoop HDFS Project ........................ SKIPPED
[INFO] ------------------------------------------------------------------------
[INFO] BUILD FAILURE
[INFO] ------------------------------------------------------------------------
[INFO] Total time: 11.105s
[INFO] Finished at: Tue Sep 13 18:23:18 UTC 2011
[INFO] Final Memory: 26M/237M
[INFO] ------------------------------------------------------------------------
[ERROR] Failed to execute goal org.codehaus.mojo:make-maven-plugin:1.0-beta-1:autoreconf (compile)
on project hadoop-hdfs: autoreconf command returned an exit value != 0. Aborting build; see
debug output for more information. -> [Help 1]
[ERROR] 
[ERROR] To see the full stack trace of the errors, re-run Maven with the -e switch.
[ERROR] Re-run Maven using the -X switch to enable full debug logging.
[ERROR] 
[ERROR] For more information about the errors and possible solutions, please read the following
articles:
[ERROR] [Help 1] http://cwiki.apache.org/confluence/display/MAVEN/MojoExecutionException
Build step 'Execute shell' marked build as failure
[WARNINGS] Skipping publisher since build result is FAILURE
Archiving artifacts
Recording test results
Publishing Javadoc
Recording fingerprints


Mime
View raw message