hadoop-hdfs-dev mailing list archives

Site index · List index
Message view « Date » · « Thread »
Top « Date » · « Thread »
From Apache Jenkins Server <jenk...@builds.apache.org>
Subject Hadoop-Hdfs-trunk - Build # 797 - Still Failing
Date Tue, 13 Sep 2011 19:03:25 GMT
See https://builds.apache.org/job/Hadoop-Hdfs-trunk/797/

###################################################################################
########################## LAST 60 LINES OF THE CONSOLE ###########################
[...truncated 8966 lines...]
[INFO] configure: WARNING: fcntl.h:     check for missing prerequisite headers?
[INFO] configure: WARNING: fcntl.h: see the Autoconf documentation
[INFO] configure: WARNING: fcntl.h:     section "Present But Cannot Be Compiled"
[INFO] configure: WARNING: fcntl.h: proceeding with the compiler's result
[INFO] configure: WARNING:     ## --------------------------------- ##
[INFO] configure: WARNING:     ## Report this to omalley@apache.org ##
[INFO] configure: WARNING:     ## --------------------------------- ##
[INFO] checking for fcntl.h... no
[INFO] checking for an ANSI C-conforming const... yes
[INFO] checking for working volatile... yes
[INFO] checking for stdbool.h that conforms to C99... yes
[INFO] checking for _Bool... no
[INFO] configure: creating ./config.status
[INFO] config.status: creating Makefile
[INFO] config.status: executing depfiles commands
[INFO] config.status: executing libtool commands
[INFO] 
[INFO] --- make-maven-plugin:1.0-beta-1:make-install (compile) @ hadoop-hdfs ---
[INFO] /bin/bash ./libtool --tag=CC   --mode=compile gcc -DPACKAGE_NAME=\"libhdfs\" -DPACKAGE_TARNAME=\"libhdfs\"
-DPACKAGE_VERSION=\"0.1.0\" -DPACKAGE_STRING=\"libhdfs\ 0.1.0\" -DPACKAGE_BUGREPORT=\"omalley@apache.org\"
-DPACKAGE_URL=\"\" -DPACKAGE=\"libhdfs\" -DVERSION=\"0.1.0\" -DSTDC_HEADERS=1 -DHAVE_SYS_TYPES_H=1
-DHAVE_SYS_STAT_H=1 -DHAVE_STDLIB_H=1 -DHAVE_STRING_H=1 -DHAVE_MEMORY_H=1 -DHAVE_STRINGS_H=1
-DHAVE_INTTYPES_H=1 -DHAVE_STDINT_H=1 -DHAVE_UNISTD_H=1 -DHAVE_DLFCN_H=1 -DLT_OBJDIR=\".libs/\"
-Dsize_t=unsigned\ int -DHAVE_STDBOOL_H=1 -I.     -g -O2 -DOS_LINUX -DDSO_DLFCN -DCPU=\"amd64\"
-m32 -I/home/jenkins/tools/java/latest/include -I/home/jenkins/tools/java/latest/include/linux
-Wall -Wstrict-prototypes -MT hdfs.lo -MD -MP -MF .deps/hdfs.Tpo -c -o hdfs.lo hdfs.c
[INFO] libtool: compile:  gcc -DPACKAGE_NAME=\"libhdfs\" -DPACKAGE_TARNAME=\"libhdfs\" -DPACKAGE_VERSION=\"0.1.0\"
"-DPACKAGE_STRING=\"libhdfs 0.1.0\"" -DPACKAGE_BUGREPORT=\"omalley@apache.org\" -DPACKAGE_URL=\"\"
-DPACKAGE=\"libhdfs\" -DVERSION=\"0.1.0\" -DSTDC_HEADERS=1 -DHAVE_SYS_TYPES_H=1 -DHAVE_SYS_STAT_H=1
-DHAVE_STDLIB_H=1 -DHAVE_STRING_H=1 -DHAVE_MEMORY_H=1 -DHAVE_STRINGS_H=1 -DHAVE_INTTYPES_H=1
-DHAVE_STDINT_H=1 -DHAVE_UNISTD_H=1 -DHAVE_DLFCN_H=1 -DLT_OBJDIR=\".libs/\" "-Dsize_t=unsigned
int" -DHAVE_STDBOOL_H=1 -I. -g -O2 -DOS_LINUX -DDSO_DLFCN -DCPU=\"amd64\" -m32 -I/home/jenkins/tools/java/latest/include
-I/home/jenkins/tools/java/latest/include/linux -Wall -Wstrict-prototypes -MT hdfs.lo -MD
-MP -MF .deps/hdfs.Tpo -c hdfs.c  -fPIC -DPIC -o .libs/hdfs.o
[INFO] In file included from /usr/include/features.h:378,
[INFO]                  from /usr/include/sys/types.h:27,
[INFO]                  from hdfs.h:22,
[INFO]                  from hdfs.c:19:
[INFO] /usr/include/gnu/stubs.h:7:27: error: gnu/stubs-32.h: No such file or directory
[INFO] In file included from /usr/include/sys/types.h:147,
[INFO]                  from hdfs.h:22,
[INFO]                  from hdfs.c:19:
[INFO] /usr/lib/gcc/x86_64-linux-gnu/4.4.3/include/stddef.h:211: error: duplicate 'unsigned'
[INFO] /usr/lib/gcc/x86_64-linux-gnu/4.4.3/include/stddef.h:211: error: two or more data types
in declaration specifiers
[INFO] make: *** [hdfs.lo] Error 1
[INFO] ------------------------------------------------------------------------
[INFO] Reactor Summary:
[INFO] 
[INFO] Apache Hadoop HDFS ................................ FAILURE [20.879s]
[INFO] Apache Hadoop HDFS Project ........................ SKIPPED
[INFO] ------------------------------------------------------------------------
[INFO] BUILD FAILURE
[INFO] ------------------------------------------------------------------------
[INFO] Total time: 21.305s
[INFO] Finished at: Tue Sep 13 19:03:24 UTC 2011
[INFO] Final Memory: 26M/268M
[INFO] ------------------------------------------------------------------------
[ERROR] Failed to execute goal org.codehaus.mojo:make-maven-plugin:1.0-beta-1:make-install
(compile) on project hadoop-hdfs: make returned an exit value != 0. Aborting build; see command
output above for more information. -> [Help 1]
[ERROR] 
[ERROR] To see the full stack trace of the errors, re-run Maven with the -e switch.
[ERROR] Re-run Maven using the -X switch to enable full debug logging.
[ERROR] 
[ERROR] For more information about the errors and possible solutions, please read the following
articles:
[ERROR] [Help 1] http://cwiki.apache.org/confluence/display/MAVEN/MojoExecutionException
Build step 'Execute shell' marked build as failure
[WARNINGS] Skipping publisher since build result is FAILURE
Archiving artifacts
Recording test results
Publishing Javadoc
Recording fingerprints
Sending e-mails to: hdfs-dev@hadoop.apache.org
Email was triggered for: Failure
Sending email for trigger: Failure



###################################################################################
############################## FAILED TESTS (if any) ##############################
No tests ran.

Mime
View raw message