hadoop-hdfs-dev mailing list archives

Site index · List index
Message view « Date » · « Thread »
Top « Date » · « Thread »
From Apache Jenkins Server <jenk...@builds.apache.org>
Subject Hadoop-Hdfs-trunk - Build # 754 - Still Failing
Date Tue, 16 Aug 2011 11:32:11 GMT
See https://builds.apache.org/job/Hadoop-Hdfs-trunk/754/

###################################################################################
########################## LAST 60 LINES OF THE CONSOLE ###########################
[...truncated 1243 lines...]
     [echo] contrib: fuse-dfs

clean-fi:

clean-sign:

clean:
   [delete] Deleting directory /home/jenkins/jenkins-slave/workspace/Hadoop-Hdfs-trunk/trunk/build

BUILD SUCCESSFUL
Total time: 0 seconds


======================================================================
======================================================================
ANALYSIS: ant -Drun.clover=true clover checkstyle test generate-clover-reports -Dtest.junit.output.format=xml
-Dtest.output=yes -Dcompile.c++=true -Dcompile.native=true -Dfindbugs.home=$FINDBUGS_HOME
-Dforrest.home=$FORREST_HOME -Dclover.home=$CLOVER_HOME -Declipse.home=$ECLIPSE_HOME
======================================================================
======================================================================


Buildfile: build.xml

clover.setup:
    [mkdir] Created dir: /home/jenkins/jenkins-slave/workspace/Hadoop-Hdfs-trunk/trunk/build/test/clover/db
[clover-setup] Clover Version 3.1.0, built on May 31 2011 (build-821)
[clover-setup] Loaded from: /home/jenkins/tools/clover/latest/lib/clover.jar

BUILD FAILED
java.lang.RuntimeException: Clover upgrades for your license ended December 14 2010, and this
version of Clover was built May 31 2011. Please visit http://www.atlassian.com/clover/renew
for information on upgrading your license.
	at com.cenqua.clover.CloverStartup.loadLicense(CloverStartup.java:103)
	at com.cenqua.clover.CloverStartup.loadLicense(CloverStartup.java:25)
	at com.cenqua.clover.tasks.AbstractCloverTask.execute(AbstractCloverTask.java:52)
	at org.apache.tools.ant.UnknownElement.execute(UnknownElement.java:288)
	at sun.reflect.GeneratedMethodAccessor1.invoke(Unknown Source)
	at sun.reflect.DelegatingMethodAccessorImpl.invoke(DelegatingMethodAccessorImpl.java:25)
	at java.lang.reflect.Method.invoke(Method.java:597)
	at org.apache.tools.ant.dispatch.DispatchUtils.execute(DispatchUtils.java:106)
	at org.apache.tools.ant.Task.perform(Task.java:348)
	at org.apache.tools.ant.Target.execute(Target.java:357)
	at org.apache.tools.ant.Target.performTasks(Target.java:385)
	at org.apache.tools.ant.Project.executeSortedTargets(Project.java:1337)
	at org.apache.tools.ant.Project.executeTarget(Project.java:1306)
	at org.apache.tools.ant.helper.DefaultExecutor.executeTargets(DefaultExecutor.java:41)
	at org.apache.tools.ant.Project.executeTargets(Project.java:1189)
	at org.apache.tools.ant.Main.runBuild(Main.java:758)
	at org.apache.tools.ant.Main.startAnt(Main.java:217)
	at org.apache.tools.ant.launch.Launcher.run(Launcher.java:257)
	at org.apache.tools.ant.launch.Launcher.main(Launcher.java:104)

Total time: 0 seconds
[FINDBUGS] Skipping publisher since build result is FAILURE
Archiving artifacts
Recording fingerprints
Recording test results
Publishing Javadoc
Publishing Clover coverage report...
No Clover report will be published due to a Build Failure
Email was triggered for: Failure
Sending email for trigger: Failure



###################################################################################
############################## FAILED TESTS (if any) ##############################
No tests ran.

Mime
View raw message