hadoop-hdfs-dev mailing list archives

Site index · List index
Message view « Date » · « Thread »
Top « Date » · « Thread »
From Apache Jenkins Server <jenk...@builds.apache.org>
Subject Hadoop-Hdfs-trunk-Commit - Build # 857 - Failure
Date Thu, 25 Aug 2011 00:24:22 GMT
See https://builds.apache.org/job/Hadoop-Hdfs-trunk-Commit/857/

###################################################################################
########################## LAST 60 LINES OF THE CONSOLE ###########################
[...truncated 10199 lines...]
[INFO] --- maven-install-plugin:2.3.1:install (default-install) @ hadoop-yarn-api ---
[INFO] Installing /home/jenkins/jenkins-slave/workspace/Hadoop-Hdfs-trunk-Commit/trunk/hadoop-mapreduce-project/hadoop-yarn/hadoop-yarn-api/target/hadoop-yarn-api-1.0-SNAPSHOT.jar
to /home/jenkins/.m2/repository/org/apache/hadoop/hadoop-yarn-api/1.0-SNAPSHOT/hadoop-yarn-api-1.0-SNAPSHOT.jar
[INFO] Installing /home/jenkins/jenkins-slave/workspace/Hadoop-Hdfs-trunk-Commit/trunk/hadoop-mapreduce-project/hadoop-yarn/hadoop-yarn-api/pom.xml
to /home/jenkins/.m2/repository/org/apache/hadoop/hadoop-yarn-api/1.0-SNAPSHOT/hadoop-yarn-api-1.0-SNAPSHOT.pom
[INFO] 
[INFO] --- maven-install-plugin:2.3.1:install-file (install-sanitized-pom) @ hadoop-yarn-api
---
[INFO] Installing /home/jenkins/jenkins-slave/workspace/Hadoop-Hdfs-trunk-Commit/trunk/hadoop-mapreduce-project/hadoop-yarn/hadoop-yarn-api/target/hadoop-yarn-api-1.0-SNAPSHOT.jar
to /home/jenkins/.m2/repository/org/apache/hadoop/hadoop-yarn-api/1.0-SNAPSHOT/hadoop-yarn-api-1.0-SNAPSHOT.jar
[INFO] Installing /home/jenkins/jenkins-slave/workspace/Hadoop-Hdfs-trunk-Commit/trunk/hadoop-mapreduce-project/hadoop-yarn/hadoop-yarn-api/target/saner-pom.xml
to /home/jenkins/.m2/repository/org/apache/hadoop/hadoop-yarn-api/1.0-SNAPSHOT/hadoop-yarn-api-1.0-SNAPSHOT.pom
[INFO] 
[INFO] --- maven-deploy-plugin:2.5:deploy (default-deploy) @ hadoop-yarn-api ---
[INFO] ------------------------------------------------------------------------
[INFO] Reactor Summary:
[INFO] 
[INFO] Apache Hadoop Project POM ......................... SUCCESS [2.384s]
[INFO] Apache Hadoop Annotations ......................... SUCCESS [2.228s]
[INFO] Apache Hadoop Project Dist POM .................... SUCCESS [1.441s]
[INFO] Apache Hadoop Assemblies .......................... SUCCESS [1.150s]
[INFO] Apache Hadoop Alfredo ............................. SUCCESS [2.034s]
[INFO] Apache Hadoop Common .............................. SUCCESS [14.810s]
[INFO] Apache Hadoop Common Project ...................... SUCCESS [0.007s]
[INFO] Apache Hadoop HDFS ................................ SUCCESS [6.066s]
[INFO] Apache Hadoop HDFS Project ........................ SUCCESS [0.005s]
[INFO] hadoop-yarn-api ................................... FAILURE [6.251s]
[INFO] hadoop-yarn-common ................................ SKIPPED
[INFO] hadoop-yarn-server-common ......................... SKIPPED
[INFO] hadoop-yarn-server-nodemanager .................... SKIPPED
[INFO] hadoop-yarn-server-resourcemanager ................ SKIPPED
[INFO] hadoop-yarn-server-tests .......................... SKIPPED
[INFO] hadoop-yarn-server ................................ SKIPPED
[INFO] hadoop-yarn ....................................... SKIPPED
[INFO] hadoop-mapreduce-client-core ...................... SKIPPED
[INFO] hadoop-mapreduce-client-common .................... SKIPPED
[INFO] hadoop-mapreduce-client-shuffle ................... SKIPPED
[INFO] hadoop-mapreduce-client-app ....................... SKIPPED
[INFO] hadoop-mapreduce-client-hs ........................ SKIPPED
[INFO] hadoop-mapreduce-client-jobclient ................. SKIPPED
[INFO] hadoop-mapreduce-client ........................... SKIPPED
[INFO] hadoop-mapreduce .................................. SKIPPED
[INFO] Apache Hadoop Main ................................ SKIPPED
[INFO] ------------------------------------------------------------------------
[INFO] BUILD FAILURE
[INFO] ------------------------------------------------------------------------
[INFO] Total time: 36.928s
[INFO] Finished at: Thu Aug 25 00:24:13 UTC 2011
[INFO] Final Memory: 34M/162M
[INFO] ------------------------------------------------------------------------
[ERROR] Failed to execute goal org.apache.maven.plugins:maven-deploy-plugin:2.5:deploy (default-deploy)
on project hadoop-yarn-api: Deployment failed: repository element was not specified in the
POM inside distributionManagement element or in -DaltDeploymentRepository=id::layout::url
parameter -> [Help 1]
[ERROR] 
[ERROR] To see the full stack trace of the errors, re-run Maven with the -e switch.
[ERROR] Re-run Maven using the -X switch to enable full debug logging.
[ERROR] 
[ERROR] For more information about the errors and possible solutions, please read the following
articles:
[ERROR] [Help 1] http://cwiki.apache.org/confluence/display/MAVEN/MojoExecutionException
[ERROR] 
[ERROR] After correcting the problems, you can resume the build with the command
[ERROR]   mvn <goals> -rf :hadoop-yarn-api
Build step 'Execute shell' marked build as failure
Updating HADOOP-7560
Email was triggered for: Failure
Sending email for trigger: Failure



###################################################################################
############################## FAILED TESTS (if any) ##############################
No tests ran.

Mime
View raw message