hadoop-hdfs-dev mailing list archives

Site index · List index
Message view « Date » · « Thread »
Top « Date » · « Thread »
From Apache Jenkins Server <jenk...@builds.apache.org>
Subject Hadoop-Hdfs-trunk-Commit - Build # 823 - Still Failing
Date Thu, 11 Aug 2011 01:07:45 GMT
See https://builds.apache.org/job/Hadoop-Hdfs-trunk-Commit/823/

###################################################################################
########################## LAST 60 LINES OF THE CONSOLE ###########################
[...truncated 2449 lines...]
    [junit] Tests run: 4, Failures: 0, Errors: 0, Time elapsed: 0.094 sec
    [junit] Running org.apache.hadoop.hdfs.server.blockmanagement.TestOverReplicatedBlocks
    [junit] Tests run: 1, Failures: 0, Errors: 0, Time elapsed: 4.122 sec
    [junit] Running org.apache.hadoop.hdfs.server.blockmanagement.TestPendingReplication
    [junit] Tests run: 1, Failures: 0, Errors: 0, Time elapsed: 7.213 sec
    [junit] Running org.apache.hadoop.hdfs.server.blockmanagement.TestReplicationPolicy
    [junit] Tests run: 1, Failures: 0, Errors: 1, Time elapsed: 0 sec
    [junit] Test org.apache.hadoop.hdfs.server.blockmanagement.TestReplicationPolicy FAILED
    [junit] Running org.apache.hadoop.hdfs.server.datanode.TestBlockReplacement
    [junit] Tests run: 2, Failures: 0, Errors: 0, Time elapsed: 21.534 sec
    [junit] Running org.apache.hadoop.hdfs.server.datanode.TestDirectoryScanner
    [junit] Tests run: 1, Failures: 0, Errors: 0, Time elapsed: 4.404 sec
    [junit] Running org.apache.hadoop.hdfs.server.datanode.TestDiskError
    [junit] Tests run: 3, Failures: 0, Errors: 0, Time elapsed: 9.577 sec
    [junit] Running org.apache.hadoop.hdfs.server.datanode.TestInterDatanodeProtocol
    [junit] Tests run: 3, Failures: 0, Errors: 0, Time elapsed: 5.807 sec
    [junit] Running org.apache.hadoop.hdfs.server.datanode.TestSimulatedFSDataset
    [junit] Tests run: 8, Failures: 0, Errors: 0, Time elapsed: 0.693 sec
    [junit] Running org.apache.hadoop.hdfs.server.namenode.TestBackupNode
    [junit] Tests run: 3, Failures: 0, Errors: 0, Time elapsed: 19.705 sec
    [junit] Running org.apache.hadoop.hdfs.server.namenode.TestCheckpoint
    [junit] Tests run: 27, Failures: 0, Errors: 1, Time elapsed: 74.535 sec
    [junit] Test org.apache.hadoop.hdfs.server.namenode.TestCheckpoint FAILED
    [junit] Running org.apache.hadoop.hdfs.server.namenode.TestEditLog
    [junit] Tests run: 13, Failures: 0, Errors: 0, Time elapsed: 24.23 sec
    [junit] Running org.apache.hadoop.hdfs.server.namenode.TestFileLimit
    [junit] Tests run: 2, Failures: 0, Errors: 0, Time elapsed: 4.378 sec
    [junit] Running org.apache.hadoop.hdfs.server.namenode.TestNamenodeCapacityReport
    [junit] Tests run: 1, Failures: 0, Errors: 0, Time elapsed: 2.809 sec
    [junit] Running org.apache.hadoop.hdfs.server.namenode.TestSafeMode
    [junit] Tests run: 1, Failures: 0, Errors: 0, Time elapsed: 4.33 sec
    [junit] Running org.apache.hadoop.hdfs.server.namenode.TestStartup
    [junit] Tests run: 6, Failures: 0, Errors: 0, Time elapsed: 23.226 sec
    [junit] Running org.apache.hadoop.hdfs.server.namenode.TestStorageRestore
    [junit] Tests run: 3, Failures: 0, Errors: 0, Time elapsed: 16.441 sec
    [junit] Running org.apache.hadoop.net.TestNetworkTopology
    [junit] Tests run: 8, Failures: 0, Errors: 0, Time elapsed: 0.114 sec
    [junit] Running org.apache.hadoop.security.TestPermission
    [junit] Tests run: 3, Failures: 0, Errors: 0, Time elapsed: 5.908 sec

checkfailure:
    [touch] Creating /home/jenkins/jenkins-slave/workspace/Hadoop-Hdfs-trunk-Commit/trunk/build/test/testsfailed

BUILD FAILED
/home/jenkins/jenkins-slave/workspace/Hadoop-Hdfs-trunk-Commit/trunk/build.xml:733: The following
error occurred while executing this line:
/home/jenkins/jenkins-slave/workspace/Hadoop-Hdfs-trunk-Commit/trunk/build.xml:690: The following
error occurred while executing this line:
/home/jenkins/jenkins-slave/workspace/Hadoop-Hdfs-trunk-Commit/trunk/build.xml:758: Tests
failed!

Total time: 11 minutes 30 seconds
[FINDBUGS] Skipping publisher since build result is FAILURE
Archiving artifacts
Publishing Clover coverage report...
No Clover report will be published due to a Build Failure
Recording test results
Publishing Javadoc
Recording fingerprints
Updating HDFS-2241
Email was triggered for: Failure
Sending email for trigger: Failure



###################################################################################
############################## FAILED TESTS (if any) ##############################
2 tests failed.
FAILED:  org.apache.hadoop.hdfs.TestHDFSServerPorts.testSecondaryNodePorts

Error Message:
Directory /test/dfs/namesecondary is in an inconsistent state: checkpoint directory does not
exist or is not accessible.

Stack Trace:
org.apache.hadoop.hdfs.server.common.InconsistentFSStateException: Directory /test/dfs/namesecondary
is in an inconsistent state: checkpoint directory does not exist or is not accessible.
	at org.apache.hadoop.hdfs.server.namenode.SecondaryNameNode$CheckpointStorage.recoverCreate(SecondaryNameNode.java:801)
	at org.apache.hadoop.hdfs.server.namenode.SecondaryNameNode.initialize(SecondaryNameNode.java:222)
	at org.apache.hadoop.hdfs.server.namenode.SecondaryNameNode.<init>(SecondaryNameNode.java:175)
	at org.apache.hadoop.hdfs.server.namenode.SecondaryNameNode.<init>(SecondaryNameNode.java:168)
	at org.apache.hadoop.hdfs.TestHDFSServerPorts.canStartSecondaryNode(TestHDFSServerPorts.java:224)
	at org.apache.hadoop.hdfs.TestHDFSServerPorts.__CLR2_4_3vpy47p10ox(TestHDFSServerPorts.java:350)
	at org.apache.hadoop.hdfs.TestHDFSServerPorts.testSecondaryNodePorts(TestHDFSServerPorts.java:339)


FAILED:  org.apache.hadoop.hdfs.server.namenode.TestCheckpoint.testSeparateEditsDirLocking

Error Message:
Cannot create directory /test/dfs/name/current

Stack Trace:
java.io.IOException: Cannot create directory /test/dfs/name/current
	at org.apache.hadoop.hdfs.server.common.Storage$StorageDirectory.clearDirectory(Storage.java:276)
	at org.apache.hadoop.hdfs.server.namenode.NNStorage.format(NNStorage.java:492)
	at org.apache.hadoop.hdfs.server.namenode.NNStorage.format(NNStorage.java:512)
	at org.apache.hadoop.hdfs.server.namenode.FSImage.format(FSImage.java:169)
	at org.apache.hadoop.hdfs.server.namenode.NameNode.format(NameNode.java:1367)
	at org.apache.hadoop.hdfs.server.namenode.NameNode.format(NameNode.java:242)
	at org.apache.hadoop.hdfs.DFSTestUtil.formatNameNode(DFSTestUtil.java:113)
	at org.apache.hadoop.hdfs.MiniDFSCluster.createNameNode(MiniDFSCluster.java:626)
	at org.apache.hadoop.hdfs.MiniDFSCluster.initMiniDFSCluster(MiniDFSCluster.java:541)
	at org.apache.hadoop.hdfs.MiniDFSCluster.<init>(MiniDFSCluster.java:257)
	at org.apache.hadoop.hdfs.MiniDFSCluster.<init>(MiniDFSCluster.java:85)
	at org.apache.hadoop.hdfs.MiniDFSCluster$Builder.build(MiniDFSCluster.java:243)
	at org.apache.hadoop.hdfs.server.namenode.TestCheckpoint.__CLR2_4_3harbaz16ju(TestCheckpoint.java:560)
	at org.apache.hadoop.hdfs.server.namenode.TestCheckpoint.testSeparateEditsDirLocking(TestCheckpoint.java:553)




Mime
View raw message