hadoop-hdfs-dev mailing list archives

Site index · List index
Message view « Date » · « Thread »
Top « Date » · « Thread »
From Apache Jenkins Server <jenk...@builds.apache.org>
Subject Hadoop-Hdfs-trunk-Commit - Build # 817 - Failure
Date Mon, 08 Aug 2011 18:27:38 GMT
See https://builds.apache.org/job/Hadoop-Hdfs-trunk-Commit/817/

###################################################################################
########################## LAST 60 LINES OF THE CONSOLE ###########################
[...truncated 2344 lines...]
    [mkdir] Created dir: /home/jenkins/jenkins-slave/workspace/Hadoop-Hdfs-trunk-Commit/trunk/build/test/data
    [mkdir] Created dir: /home/jenkins/jenkins-slave/workspace/Hadoop-Hdfs-trunk-Commit/trunk/build/test/logs
     [copy] Copying 1 file to /home/jenkins/jenkins-slave/workspace/Hadoop-Hdfs-trunk-Commit/trunk/build/test/extraconf
     [copy] Copying 1 file to /home/jenkins/jenkins-slave/workspace/Hadoop-Hdfs-trunk-Commit/trunk/build/test/extraconf
    [junit] Running org.apache.hadoop.hdfs.server.datanode.TestBlockRecovery
    [junit] Tests run: 12, Failures: 0, Errors: 0, Time elapsed: 4.717 sec
    [junit] Running org.apache.hadoop.hdfs.server.datanode.TestDataDirs
    [junit] Tests run: 1, Failures: 0, Errors: 0, Time elapsed: 0.484 sec
    [junit] Running org.apache.hadoop.hdfs.server.namenode.TestGetImageServlet
    [junit] Tests run: 2, Failures: 0, Errors: 0, Time elapsed: 0.471 sec
    [junit] Running org.apache.hadoop.hdfs.server.namenode.TestINodeFile
    [junit] Tests run: 8, Failures: 0, Errors: 0, Time elapsed: 0.237 sec
    [junit] Running org.apache.hadoop.hdfs.server.namenode.TestNNLeaseRecovery
    [junit] Tests run: 11, Failures: 0, Errors: 0, Time elapsed: 3.407 sec

checkfailure:
   [delete] Deleting directory /home/jenkins/jenkins-slave/workspace/Hadoop-Hdfs-trunk-Commit/trunk/build/test/data
    [mkdir] Created dir: /home/jenkins/jenkins-slave/workspace/Hadoop-Hdfs-trunk-Commit/trunk/build/test/data
   [delete] Deleting directory /home/jenkins/jenkins-slave/workspace/Hadoop-Hdfs-trunk-Commit/trunk/build/test/logs
    [mkdir] Created dir: /home/jenkins/jenkins-slave/workspace/Hadoop-Hdfs-trunk-Commit/trunk/build/test/logs
    [junit] Running org.apache.hadoop.cli.TestHDFSCLI
    [junit] Tests run: 1, Failures: 0, Errors: 0, Time elapsed: 47.909 sec
    [junit] Running org.apache.hadoop.fs.TestUrlStreamHandler
    [junit] Tests run: 2, Failures: 0, Errors: 0, Time elapsed: 3.539 sec
    [junit] Running org.apache.hadoop.hdfs.TestAbandonBlock
    [junit] Tests run: 2, Failures: 0, Errors: 0, Time elapsed: 4.789 sec
    [junit] Running org.apache.hadoop.hdfs.TestBlocksScheduledCounter
    [junit] Tests run: 1, Failures: 0, Errors: 0, Time elapsed: 2.633 sec
    [junit] Running org.apache.hadoop.hdfs.TestDFSShell
    [junit] Tests run: 16, Failures: 0, Errors: 0, Time elapsed: 35.323 sec
    [junit] Running org.apache.hadoop.hdfs.TestDFSShellGenericOptions
    [junit] Tests run: 1, Failures: 0, Errors: 0, Time elapsed: 2.972 sec
    [junit] Running org.apache.hadoop.hdfs.TestDFSUpgradeFromImage
    [junit] Tests run: 4, Failures: 0, Errors: 0, Time elapsed: 16.005 sec
    [junit] Running org.apache.hadoop.hdfs.TestDataTransferProtocol
    [junit] Tests run: 3, Failures: 0, Errors: 0, Time elapsed: 4.926 sec
    [junit] Running org.apache.hadoop.hdfs.TestDatanodeReport
    [junit] Tests run: 1, Failures: 0, Errors: 0, Time elapsed: 19.68 sec
    [junit] Running org.apache.hadoop.hdfs.TestDefaultNameNodePort
    [junit] Tests run: 3, Failures: 0, Errors: 0, Time elapsed: 0.354 sec
    [junit] Running org.apache.hadoop.hdfs.TestDistributedFileSystem
    [junit] Tests run: 7, Failures: 0, Errors: 0, Time elapsed: 29.076 sec
    [junit] Running org.apache.hadoop.hdfs.TestFSInputChecker
    [junit] Tests run: 1, Failures: 0, Errors: 0, Time elapsed: 3.329 sec
    [junit] Running org.apache.hadoop.hdfs.TestFSOutputSummer
    [junit] Tests run: 1, Failures: 0, Errors: 0, Time elapsed: 3.366 sec
    [junit] Running org.apache.hadoop.hdfs.TestFileAppend
    [junit] Tests run: 4, Failures: 0, Errors: 0, Time elapsed: 9.855 sec
    [junit] Running org.apache.hadoop.hdfs.TestFileAppend2
[FINDBUGS] Skipping publisher since build result is FAILURE
Archiving artifacts
Publishing Clover coverage report...
No Clover report will be published due to a Build Failure
Recording test results
Publishing Javadoc
Recording fingerprints
Updating HDFS-2238
Email was triggered for: Failure
Sending email for trigger: Failure



###################################################################################
############################## FAILED TESTS (if any) ##############################
1 tests failed.
FAILED:  TEST-org.apache.hadoop.hdfs.TestFileAppend2.xml.<init>

Error Message:


Stack Trace:
Test report file /home/jenkins/jenkins-slave/workspace/Hadoop-Hdfs-trunk-Commit/trunk/build/test/TEST-org.apache.hadoop.hdfs.TestFileAppend2.xml
was length 0



Mime
View raw message