hadoop-hdfs-dev mailing list archives

Site index · List index
Message view « Date » · « Thread »
Top « Date » · « Thread »
From Apache Jenkins Server <jenk...@builds.apache.org>
Subject Hadoop-Hdfs-trunk-Commit - Build # 819 - Still Failing
Date Mon, 08 Aug 2011 23:04:28 GMT
See https://builds.apache.org/job/Hadoop-Hdfs-trunk-Commit/819/

###################################################################################
########################## LAST 60 LINES OF THE CONSOLE ###########################
[...truncated 2444 lines...]
    [junit] Running org.apache.hadoop.hdfs.server.blockmanagement.TestHost2NodesMap
    [junit] Tests run: 4, Failures: 0, Errors: 0, Time elapsed: 0.094 sec
    [junit] Running org.apache.hadoop.hdfs.server.blockmanagement.TestOverReplicatedBlocks
    [junit] Tests run: 1, Failures: 0, Errors: 0, Time elapsed: 4.18 sec
    [junit] Running org.apache.hadoop.hdfs.server.blockmanagement.TestPendingReplication
    [junit] Tests run: 1, Failures: 0, Errors: 0, Time elapsed: 7.213 sec
    [junit] Running org.apache.hadoop.hdfs.server.blockmanagement.TestReplicationPolicy
    [junit] Tests run: 1, Failures: 0, Errors: 1, Time elapsed: 0 sec
    [junit] Test org.apache.hadoop.hdfs.server.blockmanagement.TestReplicationPolicy FAILED
    [junit] Running org.apache.hadoop.hdfs.server.datanode.TestBlockReplacement
    [junit] Tests run: 2, Failures: 0, Errors: 0, Time elapsed: 21.548 sec
    [junit] Running org.apache.hadoop.hdfs.server.datanode.TestDirectoryScanner
    [junit] Tests run: 1, Failures: 0, Errors: 0, Time elapsed: 4.141 sec
    [junit] Running org.apache.hadoop.hdfs.server.datanode.TestDiskError
    [junit] Tests run: 3, Failures: 0, Errors: 0, Time elapsed: 9.383 sec
    [junit] Running org.apache.hadoop.hdfs.server.datanode.TestInterDatanodeProtocol
    [junit] Tests run: 3, Failures: 0, Errors: 0, Time elapsed: 5.575 sec
    [junit] Running org.apache.hadoop.hdfs.server.datanode.TestSimulatedFSDataset
    [junit] Tests run: 8, Failures: 0, Errors: 0, Time elapsed: 0.678 sec
    [junit] Running org.apache.hadoop.hdfs.server.namenode.TestBackupNode
    [junit] Tests run: 3, Failures: 0, Errors: 0, Time elapsed: 19.725 sec
    [junit] Running org.apache.hadoop.hdfs.server.namenode.TestCheckpoint
    [junit] Tests run: 27, Failures: 0, Errors: 1, Time elapsed: 70.879 sec
    [junit] Test org.apache.hadoop.hdfs.server.namenode.TestCheckpoint FAILED
    [junit] Running org.apache.hadoop.hdfs.server.namenode.TestEditLog
    [junit] Tests run: 12, Failures: 0, Errors: 0, Time elapsed: 23.542 sec
    [junit] Running org.apache.hadoop.hdfs.server.namenode.TestFileLimit
    [junit] Tests run: 2, Failures: 0, Errors: 0, Time elapsed: 4.469 sec
    [junit] Running org.apache.hadoop.hdfs.server.namenode.TestNamenodeCapacityReport
    [junit] Tests run: 1, Failures: 0, Errors: 0, Time elapsed: 2.702 sec
    [junit] Running org.apache.hadoop.hdfs.server.namenode.TestSafeMode
    [junit] Tests run: 1, Failures: 0, Errors: 0, Time elapsed: 4.125 sec
    [junit] Running org.apache.hadoop.hdfs.server.namenode.TestStartup
    [junit] Tests run: 6, Failures: 0, Errors: 0, Time elapsed: 22.6 sec
    [junit] Running org.apache.hadoop.hdfs.server.namenode.TestStorageRestore
    [junit] Tests run: 3, Failures: 0, Errors: 0, Time elapsed: 15.741 sec
    [junit] Running org.apache.hadoop.net.TestNetworkTopology
    [junit] Tests run: 8, Failures: 0, Errors: 0, Time elapsed: 0.112 sec
    [junit] Running org.apache.hadoop.security.TestPermission
    [junit] Tests run: 3, Failures: 0, Errors: 0, Time elapsed: 5.833 sec

checkfailure:
    [touch] Creating /home/jenkins/jenkins-slave/workspace/Hadoop-Hdfs-trunk-Commit/trunk/build/test/testsfailed

BUILD FAILED
/home/jenkins/jenkins-slave/workspace/Hadoop-Hdfs-trunk-Commit/trunk/build.xml:733: The following
error occurred while executing this line:
/home/jenkins/jenkins-slave/workspace/Hadoop-Hdfs-trunk-Commit/trunk/build.xml:690: The following
error occurred while executing this line:
/home/jenkins/jenkins-slave/workspace/Hadoop-Hdfs-trunk-Commit/trunk/build.xml:758: Tests
failed!

Total time: 11 minutes 0 seconds
[FINDBUGS] Skipping publisher since build result is FAILURE
Archiving artifacts
Publishing Clover coverage report...
No Clover report will be published due to a Build Failure
Recording test results
Publishing Javadoc
Recording fingerprints
Email was triggered for: Failure
Sending email for trigger: Failure



###################################################################################
############################## FAILED TESTS (if any) ##############################
2 tests failed.
FAILED:  org.apache.hadoop.hdfs.TestHDFSServerPorts.testSecondaryNodePorts

Error Message:
Directory /test/dfs/namesecondary is in an inconsistent state: checkpoint directory does not
exist or is not accessible.

Stack Trace:
org.apache.hadoop.hdfs.server.common.InconsistentFSStateException: Directory /test/dfs/namesecondary
is in an inconsistent state: checkpoint directory does not exist or is not accessible.
	at org.apache.hadoop.hdfs.server.namenode.SecondaryNameNode$CheckpointStorage.recoverCreate(SecondaryNameNode.java:801)
	at org.apache.hadoop.hdfs.server.namenode.SecondaryNameNode.initialize(SecondaryNameNode.java:222)
	at org.apache.hadoop.hdfs.server.namenode.SecondaryNameNode.<init>(SecondaryNameNode.java:175)
	at org.apache.hadoop.hdfs.server.namenode.SecondaryNameNode.<init>(SecondaryNameNode.java:168)
	at org.apache.hadoop.hdfs.TestHDFSServerPorts.canStartSecondaryNode(TestHDFSServerPorts.java:224)
	at org.apache.hadoop.hdfs.TestHDFSServerPorts.__CLR2_4_3vpy47p10nt(TestHDFSServerPorts.java:350)
	at org.apache.hadoop.hdfs.TestHDFSServerPorts.testSecondaryNodePorts(TestHDFSServerPorts.java:339)


FAILED:  org.apache.hadoop.hdfs.server.namenode.TestCheckpoint.testSeparateEditsDirLocking

Error Message:
Cannot create directory /test/dfs/name/current

Stack Trace:
java.io.IOException: Cannot create directory /test/dfs/name/current
	at org.apache.hadoop.hdfs.server.common.Storage$StorageDirectory.clearDirectory(Storage.java:276)
	at org.apache.hadoop.hdfs.server.namenode.NNStorage.format(NNStorage.java:492)
	at org.apache.hadoop.hdfs.server.namenode.NNStorage.format(NNStorage.java:512)
	at org.apache.hadoop.hdfs.server.namenode.FSImage.format(FSImage.java:173)
	at org.apache.hadoop.hdfs.server.namenode.NameNode.format(NameNode.java:1361)
	at org.apache.hadoop.hdfs.server.namenode.NameNode.format(NameNode.java:237)
	at org.apache.hadoop.hdfs.DFSTestUtil.formatNameNode(DFSTestUtil.java:112)
	at org.apache.hadoop.hdfs.MiniDFSCluster.createNameNode(MiniDFSCluster.java:627)
	at org.apache.hadoop.hdfs.MiniDFSCluster.initMiniDFSCluster(MiniDFSCluster.java:542)
	at org.apache.hadoop.hdfs.MiniDFSCluster.<init>(MiniDFSCluster.java:258)
	at org.apache.hadoop.hdfs.MiniDFSCluster.<init>(MiniDFSCluster.java:86)
	at org.apache.hadoop.hdfs.MiniDFSCluster$Builder.build(MiniDFSCluster.java:244)
	at org.apache.hadoop.hdfs.server.namenode.TestCheckpoint.__CLR2_4_3harbaz16hq(TestCheckpoint.java:560)
	at org.apache.hadoop.hdfs.server.namenode.TestCheckpoint.testSeparateEditsDirLocking(TestCheckpoint.java:553)




Mime
View raw message