hadoop-hdfs-dev mailing list archives

Site index · List index
Message view « Date » · « Thread »
Top « Date » · « Thread »
From Apache Jenkins Server <jenk...@builds.apache.org>
Subject Hadoop-Hdfs-22-branch - Build # 75 - Still Failing
Date Mon, 15 Aug 2011 22:30:54 GMT
See https://builds.apache.org/job/Hadoop-Hdfs-22-branch/75/

###################################################################################
########################## LAST 60 LINES OF THE CONSOLE ###########################
[...truncated 870 lines...]

Buildfile: build.xml

clean-contrib:

clean:

BUILD FAILED
/home/jenkins/jenkins-slave/workspace/Hadoop-Hdfs-22-branch/trunk/build.xml:1285: The following
error occurred while executing this line:
/home/jenkins/jenkins-slave/workspace/Hadoop-Hdfs-22-branch/trunk/src/contrib/build.xml:60:
The following error occurred while executing this line:
/home/jenkins/jenkins-slave/workspace/Hadoop-Hdfs-22-branch/trunk/src/contrib/fuse-dfs/build.xml:22:
The following error occurred while executing this line:
/home/jenkins/jenkins-slave/workspace/Hadoop-Hdfs-22-branch/trunk/src/contrib/build-contrib.xml:68:
Source resource does not exist: /home/jenkins/jenkins-slave/workspace/Hadoop-Hdfs-22-branch/trunk/src/contrib/ivy/libraries.properties

Total time: 0 seconds


======================================================================
======================================================================
BUILD: ant clean tar mvn-deploy findbugs -Dtest.junit.output.format=xml -Dcompile.c++=true
-Dcompile.native=true -Dfindbugs.home=$FINDBUGS_HOME -Dforrest.home=$FORREST_HOME -Dclover.home=$CLOVER_HOME
-Declipse.home=$ECLIPSE_HOME
======================================================================
======================================================================


Buildfile: build.xml

clean-contrib:

clean:

BUILD FAILED
/home/jenkins/jenkins-slave/workspace/Hadoop-Hdfs-22-branch/trunk/build.xml:1285: The following
error occurred while executing this line:
/home/jenkins/jenkins-slave/workspace/Hadoop-Hdfs-22-branch/trunk/src/contrib/build.xml:60:
The following error occurred while executing this line:
/home/jenkins/jenkins-slave/workspace/Hadoop-Hdfs-22-branch/trunk/src/contrib/fuse-dfs/build.xml:22:
The following error occurred while executing this line:
/home/jenkins/jenkins-slave/workspace/Hadoop-Hdfs-22-branch/trunk/src/contrib/build-contrib.xml:68:
Source resource does not exist: /home/jenkins/jenkins-slave/workspace/Hadoop-Hdfs-22-branch/trunk/src/contrib/ivy/libraries.properties

Total time: 0 seconds


======================================================================
======================================================================
STORE: saving artifacts
======================================================================
======================================================================


mv: cannot stat `build/*.tar.gz': No such file or directory
mv: cannot stat `build/*.jar': No such file or directory
mv: cannot stat `build/test/findbugs': No such file or directory
mv: cannot stat `build/docs/api': No such file or directory
Build Failed
[FINDBUGS] Skipping publisher since build result is FAILURE
Archiving artifacts
Publishing Clover coverage report...
No Clover report will be published due to a Build Failure
Recording test results
Publishing Javadoc
Recording fingerprints
Email was triggered for: Failure
Sending email for trigger: Failure



###################################################################################
############################## FAILED TESTS (if any) ##############################
No tests ran.

Mime
View raw message