hadoop-hdfs-dev mailing list archives

Site index · List index
Message view « Date » · « Thread »
Top « Date » · « Thread »
From Apache Jenkins Server <jenk...@builds.apache.org>
Subject Hadoop-Hdfs-21-Build - Build # 153 - Still Failing
Date Fri, 08 Jul 2011 22:28:42 GMT
See https://builds.apache.org/job/Hadoop-Hdfs-21-Build/153/

###################################################################################
########################## LAST 60 LINES OF THE CONSOLE ###########################
[...truncated 3120 lines...]
[ivy:resolve] 	found javax.servlet#jstl;1.1.2 in maven2
[ivy:resolve] 	found taglibs#standard;1.1.2 in maven2
[ivy:resolve] 	found junitperf#junitperf;1.8 in maven2
[ivy:resolve] :: resolution report :: resolve 542ms :: artifacts dl 15ms
[ivy:resolve] 	:: evicted modules:
[ivy:resolve] 	commons-logging#commons-logging;1.0.4 by [commons-logging#commons-logging;1.1.1]
in [common]
[ivy:resolve] 	commons-codec#commons-codec;1.2 by [commons-codec#commons-codec;1.4] in [common]
[ivy:resolve] 	commons-logging#commons-logging;1.0.3 by [commons-logging#commons-logging;1.1.1]
in [common]
[ivy:resolve] 	commons-codec#commons-codec;1.3 by [commons-codec#commons-codec;1.4] in [common]
[ivy:resolve] 	org.slf4j#slf4j-api;1.5.2 by [org.slf4j#slf4j-api;1.5.11] in [common]
[ivy:resolve] 	org.apache.mina#mina-core;2.0.0-M4 by [org.apache.mina#mina-core;2.0.0-M5]
in [common]
[ivy:resolve] 	org.apache.ftpserver#ftplet-api;1.0.0-M2 by [org.apache.ftpserver#ftplet-api;1.0.0]
in [common]
[ivy:resolve] 	org.apache.ftpserver#ftpserver-core;1.0.0-M2 by [org.apache.ftpserver#ftpserver-core;1.0.0]
in [common]
[ivy:resolve] 	org.apache.mina#mina-core;2.0.0-M2 by [org.apache.mina#mina-core;2.0.0-M5]
in [common]
[ivy:resolve] 	commons-lang#commons-lang;2.3 by [commons-lang#commons-lang;2.5] in [common]
	---------------------------------------------------------------------
	|                  |            modules            ||   artifacts   |
	|       conf       | number| search|dwnlded|evicted|| number|dwnlded|
	---------------------------------------------------------------------
	|      common      |   62  |   2   |   0   |   10  ||   52  |   0   |
	---------------------------------------------------------------------

ivy-retrieve-common:
[ivy:retrieve] :: retrieving :: org.apache.hadoop#hdfsproxy [sync]
[ivy:retrieve] 	confs: [common]
[ivy:retrieve] 	0 artifacts copied, 52 already retrieved (0kB/7ms)
[ivy:cachepath] :: loading settings :: file = /grid/0/hudson/hudson-slave/workspace/Hadoop-Hdfs-21-Build/trunk/ivy/ivysettings.xml

compile:
     [echo] contrib: hdfsproxy

compile-examples:

compile-test:
     [echo] contrib: hdfsproxy
    [javac] Compiling 9 source files to /grid/0/hudson/hudson-slave/workspace/Hadoop-Hdfs-21-Build/trunk/build/contrib/hdfsproxy/test

test-junit:
    [junit] WARNING: multiple versions of ant detected in path for junit 
    [junit]          jar:file:/homes/hudson/tools/ant/latest/lib/ant.jar!/org/apache/tools/ant/Project.class
    [junit]      and jar:file:/homes/hudson/.ivy2/cache/ant/ant/jars/ant-1.6.5.jar!/org/apache/tools/ant/Project.class
    [junit] Running org.apache.hadoop.hdfsproxy.TestHdfsProxy
    [junit] Tests run: 1, Failures: 0, Errors: 1, Time elapsed: 3.265 sec
    [junit] Test org.apache.hadoop.hdfsproxy.TestHdfsProxy FAILED

BUILD FAILED
/grid/0/hudson/hudson-slave/workspace/Hadoop-Hdfs-21-Build/trunk/build.xml:731: The following
error occurred while executing this line:
/grid/0/hudson/hudson-slave/workspace/Hadoop-Hdfs-21-Build/trunk/build.xml:712: The following
error occurred while executing this line:
/grid/0/hudson/hudson-slave/workspace/Hadoop-Hdfs-21-Build/trunk/src/contrib/build.xml:48:
The following error occurred while executing this line:
/grid/0/hudson/hudson-slave/workspace/Hadoop-Hdfs-21-Build/trunk/src/contrib/hdfsproxy/build.xml:260:
Tests failed!

Total time: 57 minutes 28 seconds
Archiving artifacts
Recording test results
Publishing Javadoc
Recording fingerprints
Description set: 
Email was triggered for: Failure
Sending email for trigger: Failure



###################################################################################
############################## FAILED TESTS (if any) ##############################
All tests passed

Mime
View raw message