hadoop-hdfs-dev mailing list archives

Site index · List index
Message view « Date » · « Thread »
Top « Date » · « Thread »
From Apache Jenkins Server <jenk...@builds.apache.org>
Subject Hadoop-Hdfs-22-branch - Build # 72 - Failure
Date Tue, 26 Jul 2011 11:42:56 GMT
See https://builds.apache.org/job/Hadoop-Hdfs-22-branch/72/

###################################################################################
########################## LAST 60 LINES OF THE CONSOLE ###########################
[...truncated 3074 lines...]
compile-hdfs-test:
   [delete] Deleting directory /grid/0/hudson/hudson-slave/workspace/Hadoop-Hdfs-22-branch/trunk/build-fi/test/cache
    [mkdir] Created dir: /grid/0/hudson/hudson-slave/workspace/Hadoop-Hdfs-22-branch/trunk/build-fi/test/cache
     [copy] Copying 1 file to /grid/0/hudson/hudson-slave/workspace/Hadoop-Hdfs-22-branch/trunk/build-fi/test/cache
     [copy] Copying 1 file to /grid/0/hudson/hudson-slave/workspace/Hadoop-Hdfs-22-branch/trunk/build-fi/test/cache
     [copy] Copying 1 file to /grid/0/hudson/hudson-slave/workspace/Hadoop-Hdfs-22-branch/trunk/build-fi/test/cache
     [copy] Copying 1 file to /grid/0/hudson/hudson-slave/workspace/Hadoop-Hdfs-22-branch/trunk/build-fi/test/cache
     [copy] Copying 1 file to /grid/0/hudson/hudson-slave/workspace/Hadoop-Hdfs-22-branch/trunk/build-fi/test/cache
     [copy] Copying 1 file to /grid/0/hudson/hudson-slave/workspace/Hadoop-Hdfs-22-branch/trunk/build-fi/test/cache
     [copy] Copying 1 file to /grid/0/hudson/hudson-slave/workspace/Hadoop-Hdfs-22-branch/trunk/build-fi/test/cache
     [copy] Copying 1 file to /grid/0/hudson/hudson-slave/workspace/Hadoop-Hdfs-22-branch/trunk/build-fi/test/cache
     [copy] Copying 1 file to /grid/0/hudson/hudson-slave/workspace/Hadoop-Hdfs-22-branch/trunk/build-fi/test/cache
     [copy] Copying 1 file to /grid/0/hudson/hudson-slave/workspace/Hadoop-Hdfs-22-branch/trunk/build-fi/test/cache

run-test-hdfs-excluding-commit-and-smoke:
    [mkdir] Created dir: /grid/0/hudson/hudson-slave/workspace/Hadoop-Hdfs-22-branch/trunk/build-fi/test/data
    [mkdir] Created dir: /grid/0/hudson/hudson-slave/workspace/Hadoop-Hdfs-22-branch/trunk/build-fi/test/logs
     [copy] Copying 1 file to /grid/0/hudson/hudson-slave/workspace/Hadoop-Hdfs-22-branch/trunk/build-fi/test/extraconf
     [copy] Copying 1 file to /grid/0/hudson/hudson-slave/workspace/Hadoop-Hdfs-22-branch/trunk/build-fi/test/extraconf
    [junit] WARNING: multiple versions of ant detected in path for junit 
    [junit]          jar:file:/homes/hudson/tools/ant/latest/lib/ant.jar!/org/apache/tools/ant/Project.class
    [junit]      and jar:file:/homes/hudson/.ivy2/cache/ant/ant/jars/ant-1.6.5.jar!/org/apache/tools/ant/Project.class
    [junit] Running org.apache.hadoop.fs.TestFiListPath
    [junit] Tests run: 2, Failures: 0, Errors: 0, Time elapsed: 2.16 sec
    [junit] Running org.apache.hadoop.fs.TestFiRename
    [junit] Tests run: 4, Failures: 0, Errors: 0, Time elapsed: 5.367 sec
    [junit] Running org.apache.hadoop.hdfs.TestFiHFlush
    [junit] Tests run: 9, Failures: 0, Errors: 0, Time elapsed: 15.022 sec
    [junit] Running org.apache.hadoop.hdfs.TestFiHftp
    [junit] Tests run: 1, Failures: 0, Errors: 0, Time elapsed: 50.269 sec
    [junit] Running org.apache.hadoop.hdfs.TestFiPipelines
    [junit] Tests run: 3, Failures: 0, Errors: 0, Time elapsed: 5.521 sec
    [junit] Running org.apache.hadoop.hdfs.server.datanode.TestFiDataTransferProtocol
    [junit] Tests run: 29, Failures: 0, Errors: 0, Time elapsed: 208.563 sec
    [junit] Running org.apache.hadoop.hdfs.server.datanode.TestFiDataTransferProtocol2
    [junit] Tests run: 10, Failures: 0, Errors: 0, Time elapsed: 302.278 sec
    [junit] Running org.apache.hadoop.hdfs.server.datanode.TestFiPipelineClose
    [junit] Tests run: 3, Failures: 0, Errors: 0, Time elapsed: 35.369 sec

checkfailure:

-run-test-hdfs-fault-inject-withtestcaseonly:

run-test-hdfs-fault-inject:

BUILD FAILED
/grid/0/hudson/hudson-slave/workspace/Hadoop-Hdfs-22-branch/trunk/build.xml:747: Tests failed!

Total time: 56 minutes 34 seconds
[FINDBUGS] Skipping publisher since build result is FAILURE
Archiving artifacts
Publishing Clover coverage report...
No Clover report will be published due to a Build Failure
Recording test results
Publishing Javadoc
Recording fingerprints
Updating HDFS-2189
Email was triggered for: Failure
Sending email for trigger: Failure



###################################################################################
############################## FAILED TESTS (if any) ##############################
1 tests failed.
REGRESSION:  org.apache.hadoop.hdfs.server.namenode.TestBlockTokenWithDFS.testEnd2End

Error Message:
127.0.0.1:43741is not an underUtilized node

Stack Trace:
junit.framework.AssertionFailedError: 127.0.0.1:43741is not an underUtilized node
	at org.apache.hadoop.hdfs.server.balancer.Balancer.initNodes(Balancer.java:1011)
	at org.apache.hadoop.hdfs.server.balancer.Balancer.initNodes(Balancer.java:953)
	at org.apache.hadoop.hdfs.server.balancer.Balancer.run(Balancer.java:1496)
	at org.apache.hadoop.hdfs.server.balancer.TestBalancer.runBalancer(TestBalancer.java:247)
	at org.apache.hadoop.hdfs.server.balancer.TestBalancer.test(TestBalancer.java:234)
	at org.apache.hadoop.hdfs.server.balancer.TestBalancer.oneNodeTest(TestBalancer.java:307)
	at org.apache.hadoop.hdfs.server.balancer.TestBalancer.integrationTest(TestBalancer.java:319)
	at org.apache.hadoop.hdfs.server.namenode.TestBlockTokenWithDFS.__CLR3_0_2wspf0n12iu(TestBlockTokenWithDFS.java:529)
	at org.apache.hadoop.hdfs.server.namenode.TestBlockTokenWithDFS.testEnd2End(TestBlockTokenWithDFS.java:526)




Mime
View raw message