hadoop-hdfs-dev mailing list archives

Site index · List index
Message view « Date » · « Thread »
Top « Date » · « Thread »
From Apache Jenkins Server <hud...@hudson.apache.org>
Subject Hadoop-Hdfs-trunk-Commit - Build # 719 - Still Failing
Date Mon, 06 Jun 2011 23:23:39 GMT
See https://builds.apache.org/hudson/job/Hadoop-Hdfs-trunk-Commit/719/

###################################################################################
########################## LAST 60 LINES OF THE CONSOLE ###########################
[...truncated 2673 lines...]
    [junit] Running org.apache.hadoop.hdfs.server.datanode.TestDiskError
    [junit] Tests run: 3, Failures: 0, Errors: 0, Time elapsed: 9.035 sec
    [junit] Running org.apache.hadoop.hdfs.server.datanode.TestInterDatanodeProtocol
    [junit] Tests run: 3, Failures: 0, Errors: 0, Time elapsed: 5.475 sec
    [junit] Running org.apache.hadoop.hdfs.server.datanode.TestSimulatedFSDataset
    [junit] Tests run: 8, Failures: 0, Errors: 0, Time elapsed: 0.775 sec
    [junit] Running org.apache.hadoop.hdfs.server.namenode.TestBackupNode
    [junit] Tests run: 2, Failures: 0, Errors: 0, Time elapsed: 18.723 sec
    [junit] Running org.apache.hadoop.hdfs.server.namenode.TestCheckpoint
    [junit] Tests run: 4, Failures: 0, Errors: 0, Time elapsed: 30.6 sec
    [junit] Running org.apache.hadoop.hdfs.server.namenode.TestComputeInvalidateWork
    [junit] Tests run: 1, Failures: 0, Errors: 0, Time elapsed: 4.988 sec
    [junit] Running org.apache.hadoop.hdfs.server.namenode.TestDatanodeDescriptor
    [junit] Tests run: 2, Failures: 0, Errors: 0, Time elapsed: 0.165 sec
    [junit] Running org.apache.hadoop.hdfs.server.namenode.TestEditLog
    [junit] Tests run: 5, Failures: 0, Errors: 0, Time elapsed: 17.278 sec
    [junit] Running org.apache.hadoop.hdfs.server.namenode.TestFileLimit
    [junit] Tests run: 2, Failures: 0, Errors: 0, Time elapsed: 6.022 sec
    [junit] Running org.apache.hadoop.hdfs.server.namenode.TestHeartbeatHandling
    [junit] Tests run: 1, Failures: 0, Errors: 0, Time elapsed: 3.083 sec
    [junit] Running org.apache.hadoop.hdfs.server.namenode.TestHost2NodesMap
    [junit] Tests run: 4, Failures: 0, Errors: 0, Time elapsed: 0.075 sec
    [junit] Running org.apache.hadoop.hdfs.server.namenode.TestNamenodeCapacityReport
    [junit] Tests run: 1, Failures: 0, Errors: 0, Time elapsed: 3.21 sec
    [junit] Running org.apache.hadoop.hdfs.server.namenode.TestOverReplicatedBlocks
    [junit] Tests run: 1, Failures: 0, Errors: 0, Time elapsed: 3.84 sec
    [junit] Running org.apache.hadoop.hdfs.server.namenode.TestPendingReplication
    [junit] Tests run: 1, Failures: 0, Errors: 0, Time elapsed: 7.286 sec
    [junit] Running org.apache.hadoop.hdfs.server.namenode.TestReplicationPolicy
    [junit] Tests run: 8, Failures: 0, Errors: 0, Time elapsed: 0.066 sec
    [junit] Running org.apache.hadoop.hdfs.server.namenode.TestSafeMode
    [junit] Tests run: 2, Failures: 0, Errors: 0, Time elapsed: 8.837 sec
    [junit] Running org.apache.hadoop.hdfs.server.namenode.TestStartup
    [junit] Tests run: 5, Failures: 0, Errors: 0, Time elapsed: 12.136 sec
    [junit] Running org.apache.hadoop.hdfs.server.namenode.TestStorageRestore
    [junit] Tests run: 2, Failures: 0, Errors: 0, Time elapsed: 8.202 sec
    [junit] Running org.apache.hadoop.net.TestNetworkTopology
    [junit] Tests run: 8, Failures: 0, Errors: 0, Time elapsed: 0.121 sec
    [junit] Running org.apache.hadoop.security.TestPermission
    [junit] Tests run: 3, Failures: 0, Errors: 0, Time elapsed: 5.166 sec

checkfailure:
    [touch] Creating /grid/0/hudson/hudson-slave/workspace/Hadoop-Hdfs-trunk-Commit/trunk/build/test/testsfailed

BUILD FAILED
/grid/0/hudson/hudson-slave/workspace/Hadoop-Hdfs-trunk-Commit/trunk/build.xml:732: The following
error occurred while executing this line:
/grid/0/hudson/hudson-slave/workspace/Hadoop-Hdfs-trunk-Commit/trunk/build.xml:689: The following
error occurred while executing this line:
/grid/0/hudson/hudson-slave/workspace/Hadoop-Hdfs-trunk-Commit/trunk/build.xml:757: Tests
failed!

Total time: 9 minutes 31 seconds
[FINDBUGS] Skipping publisher since build result is FAILURE
Recording fingerprints
Archiving artifacts
Recording test results
Publishing Javadoc
Publishing Clover coverage report...
No Clover report will be published due to a Build Failure
Email was triggered for: Failure
Sending email for trigger: Failure



###################################################################################
############################## FAILED TESTS (if any) ##############################
1 tests failed.
FAILED:  org.apache.hadoop.cli.TestHDFSCLI.testAll

Error Message:
One of the tests failed. See the Detailed results to identify the command that failed

Stack Trace:
junit.framework.AssertionFailedError: One of the tests failed. See the Detailed results to
identify the command that failed
	at org.apache.hadoop.cli.CLITestHelper.displayResults(CLITestHelper.java:264)
	at org.apache.hadoop.cli.CLITestHelper.tearDown(CLITestHelper.java:126)
	at org.apache.hadoop.cli.TestHDFSCLI.tearDown(TestHDFSCLI.java:81)




Mime
View raw message