hadoop-hdfs-dev mailing list archives

Site index · List index
Message view « Date » · « Thread »
Top « Date » · « Thread »
From Apache Jenkins Server <jenk...@builds.apache.org>
Subject Hadoop-Hdfs-trunk-Commit - Build # 768 - Failure
Date Thu, 30 Jun 2011 07:11:24 GMT
See https://builds.apache.org/job/Hadoop-Hdfs-trunk-Commit/768/

###################################################################################
########################## LAST 60 LINES OF THE CONSOLE ###########################
[...truncated 1107 lines...]
    [mkdir] Created dir: /grid/0/hudson/hudson-slave/workspace/Hadoop-Hdfs-trunk-Commit/trunk/build/src
    [mkdir] Created dir: /grid/0/hudson/hudson-slave/workspace/Hadoop-Hdfs-trunk-Commit/trunk/build/web/webapps/hdfs/WEB-INF
    [mkdir] Created dir: /grid/0/hudson/hudson-slave/workspace/Hadoop-Hdfs-trunk-Commit/trunk/build/web/webapps/datanode/WEB-INF
    [mkdir] Created dir: /grid/0/hudson/hudson-slave/workspace/Hadoop-Hdfs-trunk-Commit/trunk/build/web/webapps/secondary/WEB-INF
    [mkdir] Created dir: /grid/0/hudson/hudson-slave/workspace/Hadoop-Hdfs-trunk-Commit/trunk/build/ant
    [mkdir] Created dir: /grid/0/hudson/hudson-slave/workspace/Hadoop-Hdfs-trunk-Commit/trunk/build/c++
    [mkdir] Created dir: /grid/0/hudson/hudson-slave/workspace/Hadoop-Hdfs-trunk-Commit/trunk/build/test
    [mkdir] Created dir: /grid/0/hudson/hudson-slave/workspace/Hadoop-Hdfs-trunk-Commit/trunk/build/test/hdfs/classes
    [mkdir] Created dir: /grid/0/hudson/hudson-slave/workspace/Hadoop-Hdfs-trunk-Commit/trunk/build/test/extraconf
    [touch] Creating /tmp/null335349822
   [delete] Deleting: /tmp/null335349822
     [copy] Copying 6 files to /grid/0/hudson/hudson-slave/workspace/Hadoop-Hdfs-trunk-Commit/trunk/build/web/webapps
     [copy] Copying 1 file to /grid/0/hudson/hudson-slave/workspace/Hadoop-Hdfs-trunk-Commit/trunk/conf
     [copy] Copying /grid/0/hudson/hudson-slave/workspace/Hadoop-Hdfs-trunk-Commit/trunk/conf/hdfs-site.xml.template
to /grid/0/hudson/hudson-slave/workspace/Hadoop-Hdfs-trunk-Commit/trunk/conf/hdfs-site.xml
    [mkdir] Created dir: /grid/0/hudson/hudson-slave/workspace/Hadoop-Hdfs-trunk-Commit/trunk/build/test/conf
     [copy] Copying 1 file to /grid/0/hudson/hudson-slave/workspace/Hadoop-Hdfs-trunk-Commit/trunk/build/test/conf
     [copy] Copying /grid/0/hudson/hudson-slave/workspace/Hadoop-Hdfs-trunk-Commit/trunk/conf/hdfs-site.xml.template
to /grid/0/hudson/hudson-slave/workspace/Hadoop-Hdfs-trunk-Commit/trunk/build/test/conf/hdfs-site.xml
     [copy] Copying 1 file to /grid/0/hudson/hudson-slave/workspace/Hadoop-Hdfs-trunk-Commit/trunk/build/test/conf
     [copy] Copying /grid/0/hudson/hudson-slave/workspace/Hadoop-Hdfs-trunk-Commit/trunk/conf/hadoop-metrics2.properties
to /grid/0/hudson/hudson-slave/workspace/Hadoop-Hdfs-trunk-Commit/trunk/build/test/conf/hadoop-metrics2.properties

compile-hdfs-classes:
    [javac] Compiling 260 source files to /grid/0/hudson/hudson-slave/workspace/Hadoop-Hdfs-trunk-Commit/trunk/build/classes
    [javac] /grid/0/hudson/hudson-slave/workspace/Hadoop-Hdfs-trunk-Commit/trunk/src/java/org/apache/hadoop/hdfs/server/namenode/StreamFile.java:156:
cannot find symbol
    [javac] symbol  : method copyBytes(org.apache.hadoop.fs.FSInputStream,java.io.OutputStream,long,boolean)
    [javac] location: class org.apache.hadoop.io.IOUtils
    [javac]     IOUtils.copyBytes(in, out, count, close);
    [javac]            ^
    [javac] Note: Some input files use or override a deprecated API.
    [javac] Note: Recompile with -Xlint:deprecation for details.
    [javac] 1 error

BUILD FAILED
/grid/0/hudson/hudson-slave/workspace/Hadoop-Hdfs-trunk-Commit/trunk/build.xml:370: Compile
failed; see the compiler error output for details.

Total time: 18 seconds


======================================================================
======================================================================
STORE: saving artifacts
======================================================================
======================================================================


mv: cannot stat `build/*.tar.gz': No such file or directory
mv: cannot stat `build/*.jar': No such file or directory
mv: cannot stat `build/test/findbugs': No such file or directory
mv: cannot stat `build/docs/api': No such file or directory
Build Failed
[FINDBUGS] Skipping publisher since build result is FAILURE
Archiving artifacts
Publishing Clover coverage report...
No Clover report will be published due to a Build Failure
Recording test results
Publishing Javadoc
Recording fingerprints
Updating HDFS-2110
Email was triggered for: Failure
Sending email for trigger: Failure



###################################################################################
############################## FAILED TESTS (if any) ##############################
No tests ran.

Mime
View raw message