hadoop-hdfs-dev mailing list archives

Site index · List index
Message view « Date » · « Thread »
Top « Date » · « Thread »
From Apache Jenkins Server <jenk...@builds.apache.org>
Subject Hadoop-Hdfs-trunk-Commit - Build # 742 - Still Failing
Date Mon, 13 Jun 2011 22:44:50 GMT
See https://builds.apache.org/job/Hadoop-Hdfs-trunk-Commit/742/

###################################################################################
########################## LAST 60 LINES OF THE CONSOLE ###########################
[...truncated 2709 lines...]
    [junit] Running org.apache.hadoop.hdfs.server.datanode.TestDiskError
    [junit] Tests run: 3, Failures: 0, Errors: 0, Time elapsed: 9.223 sec
    [junit] Running org.apache.hadoop.hdfs.server.datanode.TestInterDatanodeProtocol
    [junit] Tests run: 3, Failures: 0, Errors: 0, Time elapsed: 5.479 sec
    [junit] Running org.apache.hadoop.hdfs.server.datanode.TestSimulatedFSDataset
    [junit] Tests run: 8, Failures: 0, Errors: 0, Time elapsed: 0.782 sec
    [junit] Running org.apache.hadoop.hdfs.server.namenode.TestBackupNode
    [junit] Tests run: 2, Failures: 0, Errors: 0, Time elapsed: 18.193 sec
    [junit] Running org.apache.hadoop.hdfs.server.namenode.TestCheckpoint
    [junit] Tests run: 4, Failures: 0, Errors: 0, Time elapsed: 30.932 sec
    [junit] Running org.apache.hadoop.hdfs.server.namenode.TestComputeInvalidateWork
    [junit] Tests run: 1, Failures: 0, Errors: 0, Time elapsed: 5.049 sec
    [junit] Running org.apache.hadoop.hdfs.server.namenode.TestDatanodeDescriptor
    [junit] Tests run: 2, Failures: 0, Errors: 0, Time elapsed: 0.143 sec
    [junit] Running org.apache.hadoop.hdfs.server.namenode.TestEditLog
    [junit] Tests run: 5, Failures: 0, Errors: 0, Time elapsed: 13.237 sec
    [junit] Running org.apache.hadoop.hdfs.server.namenode.TestFileLimit
    [junit] Tests run: 2, Failures: 0, Errors: 0, Time elapsed: 4.606 sec
    [junit] Running org.apache.hadoop.hdfs.server.namenode.TestHeartbeatHandling
    [junit] Tests run: 1, Failures: 0, Errors: 0, Time elapsed: 2.97 sec
    [junit] Running org.apache.hadoop.hdfs.server.namenode.TestHost2NodesMap
    [junit] Tests run: 4, Failures: 0, Errors: 0, Time elapsed: 0.088 sec
    [junit] Running org.apache.hadoop.hdfs.server.namenode.TestNamenodeCapacityReport
    [junit] Tests run: 1, Failures: 0, Errors: 0, Time elapsed: 2.937 sec
    [junit] Running org.apache.hadoop.hdfs.server.namenode.TestOverReplicatedBlocks
    [junit] Tests run: 1, Failures: 0, Errors: 0, Time elapsed: 4.122 sec
    [junit] Running org.apache.hadoop.hdfs.server.namenode.TestPendingReplication
    [junit] Tests run: 1, Failures: 0, Errors: 0, Time elapsed: 7.315 sec
    [junit] Running org.apache.hadoop.hdfs.server.namenode.TestReplicationPolicy
    [junit] Tests run: 8, Failures: 0, Errors: 0, Time elapsed: 0.056 sec
    [junit] Running org.apache.hadoop.hdfs.server.namenode.TestSafeMode
    [junit] Tests run: 1, Failures: 0, Errors: 0, Time elapsed: 4.392 sec
    [junit] Running org.apache.hadoop.hdfs.server.namenode.TestStartup
    [junit] Tests run: 5, Failures: 0, Errors: 0, Time elapsed: 10.822 sec
    [junit] Running org.apache.hadoop.hdfs.server.namenode.TestStorageRestore
    [junit] Tests run: 2, Failures: 0, Errors: 0, Time elapsed: 8.478 sec
    [junit] Running org.apache.hadoop.net.TestNetworkTopology
    [junit] Tests run: 8, Failures: 0, Errors: 0, Time elapsed: 0.105 sec
    [junit] Running org.apache.hadoop.security.TestPermission
    [junit] Tests run: 3, Failures: 0, Errors: 0, Time elapsed: 5.615 sec

checkfailure:
    [touch] Creating /grid/0/hudson/hudson-slave/workspace/Hadoop-Hdfs-trunk-Commit/trunk/build/test/testsfailed

BUILD FAILED
/grid/0/hudson/hudson-slave/workspace/Hadoop-Hdfs-trunk-Commit/trunk/build.xml:733: The following
error occurred while executing this line:
/grid/0/hudson/hudson-slave/workspace/Hadoop-Hdfs-trunk-Commit/trunk/build.xml:690: The following
error occurred while executing this line:
/grid/0/hudson/hudson-slave/workspace/Hadoop-Hdfs-trunk-Commit/trunk/build.xml:758: Tests
failed!

Total time: 9 minutes 21 seconds
[FINDBUGS] Skipping publisher since build result is FAILURE
Archiving artifacts
Publishing Clover coverage report...
No Clover report will be published due to a Build Failure
Recording test results
Publishing Javadoc
Recording fingerprints
Email was triggered for: Failure
Sending email for trigger: Failure



###################################################################################
############################## FAILED TESTS (if any) ##############################
1 tests failed.
FAILED:  org.apache.hadoop.cli.TestHDFSCLI.testAll

Error Message:
One of the tests failed. See the Detailed results to identify the command that failed

Stack Trace:
junit.framework.AssertionFailedError: One of the tests failed. See the Detailed results to
identify the command that failed
	at org.apache.hadoop.cli.CLITestHelper.displayResults(CLITestHelper.java:264)
	at org.apache.hadoop.cli.CLITestHelper.tearDown(CLITestHelper.java:126)
	at org.apache.hadoop.cli.TestHDFSCLI.tearDown(TestHDFSCLI.java:81)




Mime
View raw message