hadoop-hdfs-dev mailing list archives

Site index · List index
Message view « Date » · « Thread »
Top « Date » · « Thread »
From Apache Jenkins Server <jenk...@builds.apache.org>
Subject Hadoop-Hdfs-trunk-Commit - Build # 734 - Still Failing
Date Fri, 10 Jun 2011 22:23:40 GMT
See https://builds.apache.org/job/Hadoop-Hdfs-trunk-Commit/734/

###################################################################################
########################## LAST 60 LINES OF THE CONSOLE ###########################
[...truncated 2684 lines...]
    [junit] Tests run: 3, Failures: 0, Errors: 0, Time elapsed: 8.881 sec
    [junit] Running org.apache.hadoop.hdfs.server.datanode.TestInterDatanodeProtocol
    [junit] Tests run: 3, Failures: 0, Errors: 0, Time elapsed: 5.531 sec
    [junit] Running org.apache.hadoop.hdfs.server.datanode.TestSimulatedFSDataset
    [junit] Tests run: 8, Failures: 0, Errors: 0, Time elapsed: 0.8 sec
    [junit] Running org.apache.hadoop.hdfs.server.namenode.TestBackupNode
    [junit] Tests run: 2, Failures: 1, Errors: 0, Time elapsed: 6.105 sec
    [junit] Test org.apache.hadoop.hdfs.server.namenode.TestBackupNode FAILED
    [junit] Running org.apache.hadoop.hdfs.server.namenode.TestCheckpoint
    [junit] Tests run: 4, Failures: 0, Errors: 0, Time elapsed: 31.357 sec
    [junit] Running org.apache.hadoop.hdfs.server.namenode.TestComputeInvalidateWork
    [junit] Tests run: 1, Failures: 0, Errors: 0, Time elapsed: 4.928 sec
    [junit] Running org.apache.hadoop.hdfs.server.namenode.TestDatanodeDescriptor
    [junit] Tests run: 2, Failures: 0, Errors: 0, Time elapsed: 0.158 sec
    [junit] Running org.apache.hadoop.hdfs.server.namenode.TestEditLog
    [junit] Tests run: 5, Failures: 0, Errors: 0, Time elapsed: 13.12 sec
    [junit] Running org.apache.hadoop.hdfs.server.namenode.TestFileLimit
    [junit] Tests run: 2, Failures: 0, Errors: 0, Time elapsed: 4.591 sec
    [junit] Running org.apache.hadoop.hdfs.server.namenode.TestHeartbeatHandling
    [junit] Tests run: 1, Failures: 0, Errors: 0, Time elapsed: 3.161 sec
    [junit] Running org.apache.hadoop.hdfs.server.namenode.TestHost2NodesMap
    [junit] Tests run: 4, Failures: 0, Errors: 0, Time elapsed: 0.085 sec
    [junit] Running org.apache.hadoop.hdfs.server.namenode.TestNamenodeCapacityReport
    [junit] Tests run: 1, Failures: 0, Errors: 0, Time elapsed: 3.087 sec
    [junit] Running org.apache.hadoop.hdfs.server.namenode.TestOverReplicatedBlocks
    [junit] Tests run: 1, Failures: 0, Errors: 0, Time elapsed: 3.794 sec
    [junit] Running org.apache.hadoop.hdfs.server.namenode.TestPendingReplication
    [junit] Tests run: 1, Failures: 0, Errors: 0, Time elapsed: 7.328 sec
    [junit] Running org.apache.hadoop.hdfs.server.namenode.TestReplicationPolicy
    [junit] Tests run: 8, Failures: 0, Errors: 0, Time elapsed: 0.056 sec
    [junit] Running org.apache.hadoop.hdfs.server.namenode.TestSafeMode
    [junit] Tests run: 2, Failures: 0, Errors: 0, Time elapsed: 8.444 sec
    [junit] Running org.apache.hadoop.hdfs.server.namenode.TestStartup
    [junit] Tests run: 5, Failures: 0, Errors: 0, Time elapsed: 10.441 sec
    [junit] Running org.apache.hadoop.hdfs.server.namenode.TestStorageRestore
    [junit] Tests run: 2, Failures: 0, Errors: 0, Time elapsed: 8.531 sec
    [junit] Running org.apache.hadoop.net.TestNetworkTopology
    [junit] Tests run: 8, Failures: 0, Errors: 0, Time elapsed: 0.104 sec
    [junit] Running org.apache.hadoop.security.TestPermission
    [junit] Tests run: 3, Failures: 0, Errors: 0, Time elapsed: 5.422 sec

checkfailure:
    [touch] Creating /grid/0/hudson/hudson-slave/workspace/Hadoop-Hdfs-trunk-Commit/trunk/build/test/testsfailed

BUILD FAILED
/grid/0/hudson/hudson-slave/workspace/Hadoop-Hdfs-trunk-Commit/trunk/build.xml:728: The following
error occurred while executing this line:
/grid/0/hudson/hudson-slave/workspace/Hadoop-Hdfs-trunk-Commit/trunk/build.xml:685: The following
error occurred while executing this line:
/grid/0/hudson/hudson-slave/workspace/Hadoop-Hdfs-trunk-Commit/trunk/build.xml:753: Tests
failed!

Total time: 9 minutes 17 seconds
[FINDBUGS] Skipping publisher since build result is FAILURE
Recording fingerprints
Archiving artifacts
Recording test results
Publishing Javadoc
Publishing Clover coverage report...
No Clover report will be published due to a Build Failure
Email was triggered for: Failure
Sending email for trigger: Failure



###################################################################################
############################## FAILED TESTS (if any) ##############################
2 tests failed.
REGRESSION:  org.apache.hadoop.hdfs.server.namenode.TestBackupNode.testCheckpoint

Error Message:
Port in use: 0.0.0.0:50105

Stack Trace:
junit.framework.AssertionFailedError: Port in use: 0.0.0.0:50105
	at org.apache.hadoop.hdfs.server.namenode.TestBackupNode.testCheckpoint(TestBackupNode.java:143)
	at org.apache.hadoop.hdfs.server.namenode.TestBackupNode.__CLR3_0_2xuql33zmx(TestBackupNode.java:103)
	at org.apache.hadoop.hdfs.server.namenode.TestBackupNode.testCheckpoint(TestBackupNode.java:102)


FAILED:  org.apache.hadoop.cli.TestHDFSCLI.testAll

Error Message:
One of the tests failed. See the Detailed results to identify the command that failed

Stack Trace:
junit.framework.AssertionFailedError: One of the tests failed. See the Detailed results to
identify the command that failed
	at org.apache.hadoop.cli.CLITestHelper.displayResults(CLITestHelper.java:264)
	at org.apache.hadoop.cli.CLITestHelper.tearDown(CLITestHelper.java:126)
	at org.apache.hadoop.cli.TestHDFSCLI.tearDown(TestHDFSCLI.java:81)




Mime
View raw message