hadoop-hdfs-dev mailing list archives

Site index · List index
Message view « Date » · « Thread »
Top « Date » · « Thread »
From Apache Jenkins Server <jenk...@builds.apache.org>
Subject Hadoop-Hdfs-trunk - Build # 691 - Still Failing
Date Wed, 08 Jun 2011 12:46:47 GMT
See https://builds.apache.org/job/Hadoop-Hdfs-trunk/691/

###################################################################################
########################## LAST 60 LINES OF THE CONSOLE ###########################
[...truncated 910677 lines...]
    [junit] 2011-06-08 12:49:22,621 INFO  datanode.DataNode (DataNode.java:shutdown(1617))
- Waiting for threadgroup to exit, active threads is 0
    [junit] 2011-06-08 12:49:22,621 WARN  datanode.DataNode (DataNode.java:offerService(1073))
- BPOfferService for block pool=BP-1051022182-127.0.1.1-1307537361413 received exception:java.lang.InterruptedException
    [junit] 2011-06-08 12:49:22,621 WARN  datanode.DataNode (DataNode.java:run(1226)) - DatanodeRegistration(127.0.0.1:56794,
storageID=DS-769260673-127.0.1.1-56794-1307537361877, infoPort=49901, ipcPort=42609, storageInfo=lv=-36;cid=testClusterID;nsid=584242300;c=0)
ending block pool service for: BP-1051022182-127.0.1.1-1307537361413
    [junit] 2011-06-08 12:49:22,721 INFO  datanode.DataBlockScanner (DataBlockScanner.java:removeBlockPool(276))
- Removed bpid=BP-1051022182-127.0.1.1-1307537361413 from blockPoolScannerMap
    [junit] 2011-06-08 12:49:22,722 INFO  datanode.DataNode (FSDataset.java:shutdownBlockPool(2569))
- Removing block pool BP-1051022182-127.0.1.1-1307537361413
    [junit] 2011-06-08 12:49:22,722 INFO  datanode.FSDatasetAsyncDiskService (FSDatasetAsyncDiskService.java:shutdown(133))
- Shutting down all async disk service threads...
    [junit] 2011-06-08 12:49:22,722 INFO  datanode.FSDatasetAsyncDiskService (FSDatasetAsyncDiskService.java:shutdown(142))
- All async disk service threads have been shut down.
    [junit] 2011-06-08 12:49:22,823 WARN  namenode.DecommissionManager (DecommissionManager.java:run(70))
- Monitor interrupted: java.lang.InterruptedException: sleep interrupted
    [junit] 2011-06-08 12:49:22,823 WARN  namenode.FSNamesystem (FSNamesystem.java:run(3085))
- ReplicationMonitor thread received InterruptedException.java.lang.InterruptedException:
sleep interrupted
    [junit] 2011-06-08 12:49:22,823 INFO  namenode.FSEditLog (FSEditLog.java:printStatistics(580))
- Number of transactions: 6 Total time for transactions(ms): 0Number of transactions batched
in Syncs: 0 Number of syncs: 3 SyncTimes(ms): 19 13 
    [junit] 2011-06-08 12:49:22,826 INFO  ipc.Server (Server.java:stop(1715)) - Stopping server
on 44000
    [junit] 2011-06-08 12:49:22,826 INFO  ipc.Server (Server.java:run(1539)) - IPC Server
handler 0 on 44000: exiting
    [junit] 2011-06-08 12:49:22,826 INFO  ipc.Server (Server.java:run(505)) - Stopping IPC
Server listener on 44000
    [junit] 2011-06-08 12:49:22,826 INFO  impl.MetricsSystemImpl (MetricsSystemImpl.java:stop(199))
- Stopping DataNode metrics system...
    [junit] 2011-06-08 12:49:22,826 INFO  ipc.Server (Server.java:run(647)) - Stopping IPC
Server Responder
    [junit] 2011-06-08 12:49:22,827 INFO  impl.MetricsSystemImpl (MetricsSystemImpl.java:stopSources(408))
- Stopping metrics source JvmMetrics
    [junit] 2011-06-08 12:49:22,827 INFO  impl.MetricsSystemImpl (MetricsSystemImpl.java:stopSources(408))
- Stopping metrics source NameNodeActivity
    [junit] 2011-06-08 12:49:22,827 INFO  impl.MetricsSystemImpl (MetricsSystemImpl.java:stopSources(408))
- Stopping metrics source RpcActivityForPort44000
    [junit] 2011-06-08 12:49:22,828 INFO  impl.MetricsSystemImpl (MetricsSystemImpl.java:stopSources(408))
- Stopping metrics source RpcDetailedActivityForPort44000
    [junit] 2011-06-08 12:49:22,828 INFO  impl.MetricsSystemImpl (MetricsSystemImpl.java:stopSources(408))
- Stopping metrics source FSNamesystem
    [junit] 2011-06-08 12:49:22,828 INFO  impl.MetricsSystemImpl (MetricsSystemImpl.java:stopSources(408))
- Stopping metrics source RpcActivityForPort42609
    [junit] 2011-06-08 12:49:22,828 INFO  impl.MetricsSystemImpl (MetricsSystemImpl.java:stopSources(408))
- Stopping metrics source RpcDetailedActivityForPort42609
    [junit] 2011-06-08 12:49:22,828 INFO  impl.MetricsSystemImpl (MetricsSystemImpl.java:stopSources(408))
- Stopping metrics source JvmMetrics-1
    [junit] 2011-06-08 12:49:22,829 INFO  impl.MetricsSystemImpl (MetricsSystemImpl.java:stopSources(408))
- Stopping metrics source DataNodeActivity-h8.grid.sp2.yahoo.net-56794
    [junit] 2011-06-08 12:49:22,829 INFO  impl.MetricsSystemImpl (MetricsSystemImpl.java:stopSources(408))
- Stopping metrics source RpcActivityForPort41601
    [junit] 2011-06-08 12:49:22,829 INFO  impl.MetricsSystemImpl (MetricsSystemImpl.java:stopSources(408))
- Stopping metrics source RpcDetailedActivityForPort41601
    [junit] 2011-06-08 12:49:22,829 INFO  impl.MetricsSystemImpl (MetricsSystemImpl.java:stopSources(408))
- Stopping metrics source JvmMetrics-2
    [junit] 2011-06-08 12:49:22,829 INFO  impl.MetricsSystemImpl (MetricsSystemImpl.java:stopSources(408))
- Stopping metrics source DataNodeActivity-h8.grid.sp2.yahoo.net-42159
    [junit] 2011-06-08 12:49:22,830 INFO  impl.MetricsSystemImpl (MetricsSystemImpl.java:stopSources(408))
- Stopping metrics source RpcActivityForPort33852
    [junit] 2011-06-08 12:49:22,830 INFO  impl.MetricsSystemImpl (MetricsSystemImpl.java:stopSources(408))
- Stopping metrics source RpcDetailedActivityForPort33852
    [junit] 2011-06-08 12:49:22,830 INFO  impl.MetricsSystemImpl (MetricsSystemImpl.java:stopSources(408))
- Stopping metrics source JvmMetrics-3
    [junit] 2011-06-08 12:49:22,830 INFO  impl.MetricsSystemImpl (MetricsSystemImpl.java:stopSources(408))
- Stopping metrics source DataNodeActivity-h8.grid.sp2.yahoo.net-38808
    [junit] 2011-06-08 12:49:22,831 INFO  impl.MetricsSystemImpl (MetricsSystemImpl.java:stopSources(408))
- Stopping metrics source RpcActivityForPort58022
    [junit] 2011-06-08 12:49:22,831 INFO  impl.MetricsSystemImpl (MetricsSystemImpl.java:stopSources(408))
- Stopping metrics source RpcDetailedActivityForPort58022
    [junit] 2011-06-08 12:49:22,831 INFO  impl.MetricsSystemImpl (MetricsSystemImpl.java:stopSources(408))
- Stopping metrics source JvmMetrics-4
    [junit] 2011-06-08 12:49:22,831 INFO  impl.MetricsSystemImpl (MetricsSystemImpl.java:stopSources(408))
- Stopping metrics source DataNodeActivity-h8.grid.sp2.yahoo.net-59584
    [junit] 2011-06-08 12:49:22,831 INFO  impl.MetricsSystemImpl (MetricsSystemImpl.java:stop(205))
- DataNode metrics system stopped.
    [junit] 2011-06-08 12:49:22,832 INFO  impl.MetricsSystemImpl (MetricsSystemImpl.java:shutdown(553))
- DataNode metrics system shutdown complete.
    [junit] Tests run: 16, Failures: 0, Errors: 0, Time elapsed: 103.881 sec

checkfailure:

-run-test-hdfs-fault-inject-withtestcaseonly:

run-test-hdfs-fault-inject:

BUILD FAILED
/grid/0/hudson/hudson-slave/workspace/Hadoop-Hdfs-trunk/trunk/build.xml:772: Tests failed!

Total time: 73 minutes 17 seconds
[FINDBUGS] Skipping publisher since build result is FAILURE
Publishing Javadoc
Archiving artifacts
Recording test results
Recording fingerprints
Publishing Clover coverage report...
No Clover report will be published due to a Build Failure
Email was triggered for: Failure
Sending email for trigger: Failure



###################################################################################
############################## FAILED TESTS (if any) ##############################
4 tests failed.
REGRESSION:  org.apache.hadoop.fs.TestUrlStreamHandler.testDfsUrls

Error Message:
port out of range:-1

Stack Trace:
java.lang.IllegalArgumentException: port out of range:-1
	at java.net.InetSocketAddress.<init>(InetSocketAddress.java:118)
	at org.apache.hadoop.hdfs.server.namenode.NameNode$1.run(NameNode.java:568)
	at org.apache.hadoop.hdfs.server.namenode.NameNode$1.run(NameNode.java:507)
	at java.security.AccessController.doPrivileged(Native Method)
	at javax.security.auth.Subject.doAs(Subject.java:396)
	at org.apache.hadoop.security.UserGroupInformation.doAs(UserGroupInformation.java:1131)
	at org.apache.hadoop.hdfs.server.namenode.NameNode.startHttpServer(NameNode.java:507)
	at org.apache.hadoop.hdfs.server.namenode.NameNode.activate(NameNode.java:457)
	at org.apache.hadoop.hdfs.server.namenode.NameNode.initialize(NameNode.java:441)
	at org.apache.hadoop.hdfs.server.namenode.NameNode.<init>(NameNode.java:626)
	at org.apache.hadoop.hdfs.server.namenode.NameNode.<init>(NameNode.java:618)
	at org.apache.hadoop.hdfs.server.namenode.NameNode.createNameNode(NameNode.java:1699)
	at org.apache.hadoop.hdfs.MiniDFSCluster.createNameNode(MiniDFSCluster.java:612)
	at org.apache.hadoop.hdfs.MiniDFSCluster.initMiniDFSCluster(MiniDFSCluster.java:516)
	at org.apache.hadoop.hdfs.MiniDFSCluster.<init>(MiniDFSCluster.java:245)
	at org.apache.hadoop.hdfs.MiniDFSCluster.<init>(MiniDFSCluster.java:82)
	at org.apache.hadoop.hdfs.MiniDFSCluster$Builder.build(MiniDFSCluster.java:231)
	at org.apache.hadoop.fs.TestUrlStreamHandler.__CLR3_0_28fyd0614ry(TestUrlStreamHandler.java:53)
	at org.apache.hadoop.fs.TestUrlStreamHandler.testDfsUrls(TestUrlStreamHandler.java:50)


REGRESSION:  org.apache.hadoop.hdfs.TestFileAppend2.testComplexAppend

Error Message:
testComplexAppend Worker encountered exceptions.

Stack Trace:
junit.framework.AssertionFailedError: testComplexAppend Worker encountered exceptions.
	at org.apache.hadoop.hdfs.TestFileAppend2.__CLR3_0_2dvc53316o4(TestFileAppend2.java:386)
	at org.apache.hadoop.hdfs.TestFileAppend2.testComplexAppend(TestFileAppend2.java:331)


REGRESSION:  org.apache.hadoop.hdfs.server.namenode.TestBackupNode.testCheckpoint

Error Message:
Problem binding to /0.0.0.0:50100 : Address already in use

Stack Trace:
junit.framework.AssertionFailedError: Problem binding to /0.0.0.0:50100 : Address already
in use
	at org.apache.hadoop.hdfs.server.namenode.TestBackupNode.testCheckpoint(TestBackupNode.java:143)
	at org.apache.hadoop.hdfs.server.namenode.TestBackupNode.__CLR3_0_2xuql33rez(TestBackupNode.java:103)
	at org.apache.hadoop.hdfs.server.namenode.TestBackupNode.testCheckpoint(TestBackupNode.java:102)


FAILED:  org.apache.hadoop.cli.TestHDFSCLI.testAll

Error Message:
One of the tests failed. See the Detailed results to identify the command that failed

Stack Trace:
junit.framework.AssertionFailedError: One of the tests failed. See the Detailed results to
identify the command that failed
	at org.apache.hadoop.cli.CLITestHelper.displayResults(CLITestHelper.java:264)
	at org.apache.hadoop.cli.CLITestHelper.tearDown(CLITestHelper.java:126)
	at org.apache.hadoop.cli.TestHDFSCLI.tearDown(TestHDFSCLI.java:81)




Mime
View raw message