hadoop-hdfs-dev mailing list archives

Site index · List index
Message view « Date » · « Thread »
Top « Date » · « Thread »
From Apache Jenkins Server <hud...@hudson.apache.org>
Subject Hadoop-Hdfs-trunk-Commit - Build # 628 - Still Failing
Date Sun, 08 May 2011 21:03:26 GMT
See https://builds.apache.org/hudson/job/Hadoop-Hdfs-trunk-Commit/628/

###################################################################################
########################## LAST 60 LINES OF THE CONSOLE ###########################
[...truncated 2870 lines...]
    [junit] Running org.apache.hadoop.hdfs.server.datanode.TestInterDatanodeProtocol
    [junit] Tests run: 3, Failures: 0, Errors: 0, Time elapsed: 4.696 sec
    [junit] Running org.apache.hadoop.hdfs.server.datanode.TestSimulatedFSDataset
    [junit] Tests run: 8, Failures: 0, Errors: 0, Time elapsed: 0.706 sec
    [junit] Running org.apache.hadoop.hdfs.server.namenode.TestBackupNode
    [junit] Tests run: 2, Failures: 0, Errors: 0, Time elapsed: 17.472 sec
    [junit] Running org.apache.hadoop.hdfs.server.namenode.TestCheckpoint
    [junit] Tests run: 4, Failures: 0, Errors: 0, Time elapsed: 29.645 sec
    [junit] Running org.apache.hadoop.hdfs.server.namenode.TestComputeInvalidateWork
    [junit] Tests run: 1, Failures: 0, Errors: 0, Time elapsed: 4.713 sec
    [junit] Running org.apache.hadoop.hdfs.server.namenode.TestDatanodeDescriptor
    [junit] Tests run: 2, Failures: 0, Errors: 0, Time elapsed: 0.157 sec
    [junit] Running org.apache.hadoop.hdfs.server.namenode.TestEditLog
    [junit] Tests run: 4, Failures: 0, Errors: 0, Time elapsed: 12.017 sec
    [junit] Running org.apache.hadoop.hdfs.server.namenode.TestFileLimit
    [junit] Tests run: 2, Failures: 0, Errors: 0, Time elapsed: 4.601 sec
    [junit] Running org.apache.hadoop.hdfs.server.namenode.TestHeartbeatHandling
    [junit] Tests run: 1, Failures: 0, Errors: 0, Time elapsed: 2.954 sec
    [junit] Running org.apache.hadoop.hdfs.server.namenode.TestHost2NodesMap
    [junit] Tests run: 4, Failures: 0, Errors: 0, Time elapsed: 0.085 sec
    [junit] Running org.apache.hadoop.hdfs.server.namenode.TestNamenodeCapacityReport
    [junit] Tests run: 1, Failures: 0, Errors: 0, Time elapsed: 2.645 sec
    [junit] Running org.apache.hadoop.hdfs.server.namenode.TestOverReplicatedBlocks
    [junit] Tests run: 1, Failures: 0, Errors: 0, Time elapsed: 3.539 sec
    [junit] Running org.apache.hadoop.hdfs.server.namenode.TestPendingReplication
    [junit] Tests run: 1, Failures: 0, Errors: 0, Time elapsed: 7.308 sec
    [junit] Running org.apache.hadoop.hdfs.server.namenode.TestReplicationPolicy
    [junit] Tests run: 8, Failures: 0, Errors: 0, Time elapsed: 0.058 sec
    [junit] Running org.apache.hadoop.hdfs.server.namenode.TestSafeMode
    [junit] Tests run: 2, Failures: 0, Errors: 0, Time elapsed: 8.415 sec
    [junit] Running org.apache.hadoop.hdfs.server.namenode.TestStartup
    [junit] Tests run: 5, Failures: 0, Errors: 0, Time elapsed: 9.495 sec
    [junit] Running org.apache.hadoop.hdfs.server.namenode.TestStorageRestore
    [junit] Tests run: 2, Failures: 0, Errors: 0, Time elapsed: 7.863 sec
    [junit] Running org.apache.hadoop.net.TestNetworkTopology
    [junit] Tests run: 8, Failures: 0, Errors: 0, Time elapsed: 0.114 sec
    [junit] Running org.apache.hadoop.security.TestPermission
    [junit] Tests run: 3, Failures: 0, Errors: 0, Time elapsed: 4.819 sec

checkfailure:
    [touch] Creating /grid/0/hudson/hudson-slave/workspace/Hadoop-Hdfs-trunk-Commit/trunk/build/test/testsfailed

BUILD FAILED
/grid/0/hudson/hudson-slave/workspace/Hadoop-Hdfs-trunk-Commit/trunk/build.xml:706: The following
error occurred while executing this line:
/grid/0/hudson/hudson-slave/workspace/Hadoop-Hdfs-trunk-Commit/trunk/build.xml:663: The following
error occurred while executing this line:
/grid/0/hudson/hudson-slave/workspace/Hadoop-Hdfs-trunk-Commit/trunk/build.xml:731: Tests
failed!

Total time: 9 minutes 1 second
[FINDBUGS] Skipping publisher since build result is FAILURE
Recording fingerprints
Archiving artifacts
Recording test results
Publishing Javadoc
Error updating JIRA issues. Saving issues for next build.
JIRA is currently being reindexed. Depending on how large the database is, this may take a
few minutes. Jira will automatically become available as soon as this task is complete.  
         
Publishing Clover coverage report...
No Clover report will be published due to a Build Failure
Email was triggered for: Failure
Sending email for trigger: Failure



###################################################################################
############################## FAILED TESTS (if any) ##############################
2 tests failed.
REGRESSION:  org.apache.hadoop.hdfs.TestDFSShell.testErrOutPut

Error Message:
 -mkdir returned -1 

Stack Trace:
junit.framework.AssertionFailedError:  -mkdir returned -1 
	at org.apache.hadoop.hdfs.TestDFSShell.__CLR3_0_2yogg6zvg9(TestDFSShell.java:392)
	at org.apache.hadoop.hdfs.TestDFSShell.testErrOutPut(TestDFSShell.java:308)


FAILED:  org.apache.hadoop.cli.TestHDFSCLI.testAll

Error Message:
One of the tests failed. See the Detailed results to identify the command that failed

Stack Trace:
junit.framework.AssertionFailedError: One of the tests failed. See the Detailed results to
identify the command that failed
	at org.apache.hadoop.cli.CLITestHelper.displayResults(CLITestHelper.java:264)
	at org.apache.hadoop.cli.CLITestHelper.tearDown(CLITestHelper.java:126)
	at org.apache.hadoop.cli.TestHDFSCLI.tearDown(TestHDFSCLI.java:81)




Mime
View raw message