hadoop-hdfs-dev mailing list archives

Site index · List index
Message view « Date » · « Thread »
Top « Date » · « Thread »
From Apache Jenkins Server <hud...@hudson.apache.org>
Subject Hadoop-Hdfs-22-branch - Build # 52 - Still Failing
Date Fri, 20 May 2011 11:33:47 GMT
See https://builds.apache.org/hudson/job/Hadoop-Hdfs-22-branch/52/

###################################################################################
########################## LAST 60 LINES OF THE CONSOLE ###########################
[...truncated 3049 lines...]

compile-hdfs-test:
   [delete] Deleting directory /grid/0/hudson/hudson-slave/workspace/Hadoop-Hdfs-22-branch/trunk/build-fi/test/cache
    [mkdir] Created dir: /grid/0/hudson/hudson-slave/workspace/Hadoop-Hdfs-22-branch/trunk/build-fi/test/cache
     [copy] Copying 1 file to /grid/0/hudson/hudson-slave/workspace/Hadoop-Hdfs-22-branch/trunk/build-fi/test/cache
     [copy] Copying 1 file to /grid/0/hudson/hudson-slave/workspace/Hadoop-Hdfs-22-branch/trunk/build-fi/test/cache
     [copy] Copying 1 file to /grid/0/hudson/hudson-slave/workspace/Hadoop-Hdfs-22-branch/trunk/build-fi/test/cache
     [copy] Copying 1 file to /grid/0/hudson/hudson-slave/workspace/Hadoop-Hdfs-22-branch/trunk/build-fi/test/cache
     [copy] Copying 1 file to /grid/0/hudson/hudson-slave/workspace/Hadoop-Hdfs-22-branch/trunk/build-fi/test/cache
     [copy] Copying 1 file to /grid/0/hudson/hudson-slave/workspace/Hadoop-Hdfs-22-branch/trunk/build-fi/test/cache
     [copy] Copying 1 file to /grid/0/hudson/hudson-slave/workspace/Hadoop-Hdfs-22-branch/trunk/build-fi/test/cache
     [copy] Copying 1 file to /grid/0/hudson/hudson-slave/workspace/Hadoop-Hdfs-22-branch/trunk/build-fi/test/cache
     [copy] Copying 1 file to /grid/0/hudson/hudson-slave/workspace/Hadoop-Hdfs-22-branch/trunk/build-fi/test/cache
     [copy] Copying 1 file to /grid/0/hudson/hudson-slave/workspace/Hadoop-Hdfs-22-branch/trunk/build-fi/test/cache

run-test-hdfs-excluding-commit-and-smoke:
    [mkdir] Created dir: /grid/0/hudson/hudson-slave/workspace/Hadoop-Hdfs-22-branch/trunk/build-fi/test/data
    [mkdir] Created dir: /grid/0/hudson/hudson-slave/workspace/Hadoop-Hdfs-22-branch/trunk/build-fi/test/logs
     [copy] Copying 1 file to /grid/0/hudson/hudson-slave/workspace/Hadoop-Hdfs-22-branch/trunk/build-fi/test/extraconf
     [copy] Copying 1 file to /grid/0/hudson/hudson-slave/workspace/Hadoop-Hdfs-22-branch/trunk/build-fi/test/extraconf
    [junit] WARNING: multiple versions of ant detected in path for junit 
    [junit]          jar:file:/homes/hudson/tools/ant/latest/lib/ant.jar!/org/apache/tools/ant/Project.class
    [junit]      and jar:file:/homes/hudson/.ivy2/cache/ant/ant/jars/ant-1.6.5.jar!/org/apache/tools/ant/Project.class
    [junit] Running org.apache.hadoop.fs.TestFiListPath
    [junit] Tests run: 2, Failures: 0, Errors: 0, Time elapsed: 2.213 sec
    [junit] Running org.apache.hadoop.fs.TestFiRename
    [junit] Tests run: 4, Failures: 0, Errors: 0, Time elapsed: 5.582 sec
    [junit] Running org.apache.hadoop.hdfs.TestFiHFlush
    [junit] Tests run: 9, Failures: 0, Errors: 0, Time elapsed: 15.679 sec
    [junit] Running org.apache.hadoop.hdfs.TestFiHftp
    [junit] Tests run: 1, Failures: 0, Errors: 0, Time elapsed: 41.616 sec
    [junit] Running org.apache.hadoop.hdfs.TestFiPipelines
    [junit] Tests run: 3, Failures: 0, Errors: 0, Time elapsed: 5.787 sec
    [junit] Running org.apache.hadoop.hdfs.server.datanode.TestFiDataTransferProtocol
    [junit] Tests run: 29, Failures: 0, Errors: 0, Time elapsed: 211.716 sec
    [junit] Running org.apache.hadoop.hdfs.server.datanode.TestFiDataTransferProtocol2
    [junit] Tests run: 10, Failures: 0, Errors: 0, Time elapsed: 410.337 sec
    [junit] Running org.apache.hadoop.hdfs.server.datanode.TestFiPipelineClose
    [junit] Tests run: 3, Failures: 0, Errors: 0, Time elapsed: 35.621 sec

checkfailure:

-run-test-hdfs-fault-inject-withtestcaseonly:

run-test-hdfs-fault-inject:

BUILD FAILED
/grid/0/hudson/hudson-slave/workspace/Hadoop-Hdfs-22-branch/trunk/build.xml:746: Tests failed!

Total time: 60 minutes 22 seconds
[FINDBUGS] Skipping publisher since build result is FAILURE
Publishing Javadoc
Archiving artifacts
Recording test results
Recording fingerprints
Publishing Clover coverage report...
No Clover report will be published due to a Build Failure
Email was triggered for: Failure
Sending email for trigger: Failure



###################################################################################
############################## FAILED TESTS (if any) ##############################
3 tests failed.
REGRESSION:  org.apache.hadoop.hdfs.server.balancer.TestBalancer.testBalancer0

Error Message:
127.0.0.1:44072is not an underUtilized node

Stack Trace:
junit.framework.AssertionFailedError: 127.0.0.1:44072is not an underUtilized node
	at org.apache.hadoop.hdfs.server.balancer.Balancer.initNodes(Balancer.java:1011)
	at org.apache.hadoop.hdfs.server.balancer.Balancer.initNodes(Balancer.java:953)
	at org.apache.hadoop.hdfs.server.balancer.Balancer.run(Balancer.java:1496)
	at org.apache.hadoop.hdfs.server.balancer.TestBalancer.runBalancer(TestBalancer.java:247)
	at org.apache.hadoop.hdfs.server.balancer.TestBalancer.test(TestBalancer.java:234)
	at org.apache.hadoop.hdfs.server.balancer.TestBalancer.twoNodeTest(TestBalancer.java:312)
	at org.apache.hadoop.hdfs.server.balancer.TestBalancer.__CLR3_0_29j3j5bp2t(TestBalancer.java:328)
	at org.apache.hadoop.hdfs.server.balancer.TestBalancer.testBalancer0(TestBalancer.java:324)


REGRESSION:  org.apache.hadoop.hdfs.server.namenode.TestNodeCount.testNodeCount

Error Message:
null

Stack Trace:
java.lang.NullPointerException
	at org.apache.hadoop.hdfs.server.namenode.BlockManager.countNodes(BlockManager.java:1436)
	at org.apache.hadoop.hdfs.server.namenode.TestNodeCount.__CLR3_0_29bdgm611x7(TestNodeCount.java:119)
	at org.apache.hadoop.hdfs.server.namenode.TestNodeCount.testNodeCount(TestNodeCount.java:40)


FAILED:  org.apache.hadoop.hdfs.TestHDFSTrash.testTrashEmptier

Error Message:
null

Stack Trace:
junit.framework.AssertionFailedError: null
	at org.apache.hadoop.fs.TestTrash.testTrashEmptier(TestTrash.java:473)
	at junit.extensions.TestDecorator.basicRun(TestDecorator.java:24)
	at junit.extensions.TestSetup$1.protect(TestSetup.java:23)
	at junit.extensions.TestSetup.run(TestSetup.java:27)




Mime
View raw message