hadoop-hdfs-dev mailing list archives

Site index · List index
Message view « Date » · « Thread »
Top « Date » · « Thread »
From Apache Hudson Server <hud...@hudson.apache.org>
Subject Hadoop-Hdfs-trunk - Build # 639 - Still Failing
Date Sat, 16 Apr 2011 11:31:44 GMT
See https://hudson.apache.org/hudson/job/Hadoop-Hdfs-trunk/639/

###################################################################################
########################## LAST 60 LINES OF THE CONSOLE ###########################
[...truncated 1819 lines...]
    [javac]                                              ^
    [javac] /grid/0/hudson/hudson-slave/workspace/Hadoop-Hdfs-trunk/trunk/src/test/hdfs/org/apache/hadoop/cli/TestHDFSCLI.java:93:
cannot find symbol
    [javac] symbol  : class TestCmd
    [javac] location: class org.apache.hadoop.cli.TestHDFSCLI
    [javac]   protected Result execute(TestCmd cmd) throws Exception {
    [javac]                            ^
    [javac] /grid/0/hudson/hudson-slave/workspace/Hadoop-Hdfs-trunk/trunk/src/test/hdfs/org/apache/hadoop/cli/CmdFactoryDFS.java:32:
cannot find symbol
    [javac] symbol  : variable DFSADMIN
    [javac] location: class org.apache.hadoop.cli.CmdFactoryDFS
    [javac]       case DFSADMIN:
    [javac]            ^
    [javac] /grid/0/hudson/hudson-slave/workspace/Hadoop-Hdfs-trunk/trunk/src/test/hdfs/org/apache/hadoop/cli/CmdFactoryDFS.java:33:
package CLICommands does not exist
    [javac]         executor = new CLICommands.FSCmdExecutor(tag, new DFSAdmin());
    [javac]                                   ^
    [javac] /grid/0/hudson/hudson-slave/workspace/Hadoop-Hdfs-trunk/trunk/src/test/hdfs/org/apache/hadoop/cli/CmdFactoryDFS.java:36:
cannot find symbol
    [javac] symbol  : variable CmdFactory
    [javac] location: class org.apache.hadoop.cli.CmdFactoryDFS
    [javac]         executor = CmdFactory.getCommandExecutor(cmd, tag);
    [javac]                    ^
    [javac] /grid/0/hudson/hudson-slave/workspace/Hadoop-Hdfs-trunk/trunk/src/test/hdfs/org/apache/hadoop/hdfs/server/namenode/TestStorageRestore.java:355:
cannot find symbol
    [javac] symbol  : class TestCmd
    [javac] location: class org.apache.hadoop.cli.util.CLITestData
    [javac]           new CLITestData.TestCmd(cmd, CLITestData.TestCmd.CommandType.DFSADMIN),
    [javac]                          ^
    [javac] /grid/0/hudson/hudson-slave/workspace/Hadoop-Hdfs-trunk/trunk/src/test/hdfs/org/apache/hadoop/hdfs/server/namenode/TestStorageRestore.java:355:
cannot find symbol
    [javac] symbol  : variable TestCmd
    [javac] location: class org.apache.hadoop.cli.util.CLITestData
    [javac]           new CLITestData.TestCmd(cmd, CLITestData.TestCmd.CommandType.DFSADMIN),
    [javac]                                                   ^
    [javac] Note: Some input files use or override a deprecated API.
    [javac] Note: Recompile with -Xlint:deprecation for details.
    [javac] 11 errors

BUILD FAILED
/grid/0/hudson/hudson-slave/workspace/Hadoop-Hdfs-trunk/trunk/build.xml:412: The following
error occurred while executing this line:
/grid/0/hudson/hudson-slave/workspace/Hadoop-Hdfs-trunk/trunk/build.xml:446: Compile failed;
see the compiler error output for details.

Total time: 44 seconds


======================================================================
======================================================================
STORE: saving artifacts
======================================================================
======================================================================


mv: cannot stat `build/*.tar.gz': No such file or directory
mv: cannot stat `build/test/findbugs': No such file or directory
Build Failed
[FINDBUGS] Skipping publisher since build result is FAILURE
Publishing Javadoc
Archiving artifacts
Recording test results
Recording fingerprints
Publishing Clover coverage report...
No Clover report will be published due to a Build Failure
Email was triggered for: Failure
Sending email for trigger: Failure



###################################################################################
############################## FAILED TESTS (if any) ##############################
No tests ran.

Mime
View raw message