hadoop-hdfs-dev mailing list archives

Site index · List index
Message view « Date » · « Thread »
Top « Date » · « Thread »
From Apache Hudson Server <hud...@hudson.apache.org>
Subject Hadoop-Hdfs-trunk-Commit - Build # 572 - Still Failing
Date Tue, 29 Mar 2011 00:41:42 GMT
See https://hudson.apache.org/hudson/job/Hadoop-Hdfs-trunk-Commit/572/

###################################################################################
########################## LAST 60 LINES OF THE CONSOLE ###########################
[...truncated 1092 lines...]
     [copy] Copying 1 file to /grid/0/hudson/hudson-slave/workspace/Hadoop-Hdfs-trunk-Commit/trunk/build/classes

compile-core:

jar:
      [jar] Building jar: /grid/0/hudson/hudson-slave/workspace/Hadoop-Hdfs-trunk-Commit/trunk/build/hadoop-hdfs-0.23.0-SNAPSHOT.jar
      [jar] Building jar: /grid/0/hudson/hudson-slave/workspace/Hadoop-Hdfs-trunk-Commit/trunk/build/hadoop-hdfs-0.23.0-SNAPSHOT-sources.jar

ivy-resolve-test:
[ivy:resolve] downloading https://repository.apache.org/content/repositories/snapshots/org/apache/hadoop/hadoop-common-test/0.23.0-SNAPSHOT/hadoop-common-test-0.23.0-20110328.235221-63.jar
...
[ivy:resolve] .....................................................................................................
(722kB)
[ivy:resolve] .. (0kB)
[ivy:resolve] 	[SUCCESSFUL ] org.apache.hadoop#hadoop-common-test;0.23.0-SNAPSHOT!hadoop-common-test.jar
(734ms)

ivy-retrieve-test:

compile-hdfs-test:
    [javac] Compiling 191 source files to /grid/0/hudson/hudson-slave/workspace/Hadoop-Hdfs-trunk-Commit/trunk/build/test/hdfs/classes
    [javac] /grid/0/hudson/hudson-slave/workspace/Hadoop-Hdfs-trunk-Commit/trunk/src/test/hdfs/org/apache/hadoop/hdfs/TestDFSShell.java:719:
cannot find symbol
    [javac] symbol  : constructor Count(java.lang.String[],int,org.apache.hadoop.conf.Configuration)
    [javac] location: class org.apache.hadoop.fs.shell.Count
    [javac]       assertEquals(0, new Count(new String[]{root, localstr}, 0, conf).runAll());
    [javac]                       ^
    [javac] /grid/0/hudson/hudson-slave/workspace/Hadoop-Hdfs-trunk-Commit/trunk/src/test/hdfs/org/apache/hadoop/hdfs/TestDFSShell.java:737:
cannot find symbol
    [javac] symbol  : constructor Count(java.lang.String[],int,org.apache.hadoop.conf.Configuration)
    [javac] location: class org.apache.hadoop.fs.shell.Count
    [javac]       new Count(new String[]{path}, 0, conf).runAll();
    [javac]       ^
    [javac] Note: Some input files use or override a deprecated API.
    [javac] Note: Recompile with -Xlint:deprecation for details.
    [javac] 2 errors

BUILD FAILED
/grid/0/hudson/hudson-slave/workspace/Hadoop-Hdfs-trunk-Commit/trunk/build.xml:412: The following
error occurred while executing this line:
/grid/0/hudson/hudson-slave/workspace/Hadoop-Hdfs-trunk-Commit/trunk/build.xml:446: Compile
failed; see the compiler error output for details.

Total time: 19 seconds


======================================================================
======================================================================
STORE: saving artifacts
======================================================================
======================================================================


mv: cannot stat `build/*.tar.gz': No such file or directory
mv: cannot stat `build/test/findbugs': No such file or directory
mv: cannot stat `build/docs/api': No such file or directory
Build Failed
[FINDBUGS] Skipping publisher since build result is FAILURE
Recording fingerprints
Archiving artifacts
Recording test results
Publishing Javadoc
Publishing Clover coverage report...
No Clover report will be published due to a Build Failure
Email was triggered for: Failure
Sending email for trigger: Failure



###################################################################################
############################## FAILED TESTS (if any) ##############################
No tests ran.

Mime
View raw message