hadoop-hdfs-dev mailing list archives

Site index · List index
Message view « Date » · « Thread »
Top « Date » · « Thread »
From Apache Hudson Server <hud...@hudson.apache.org>
Subject Hadoop-Hdfs-trunk - Build # 587 - Still Failing
Date Sat, 19 Feb 2011 23:39:14 GMT
See https://hudson.apache.org/hudson/job/Hadoop-Hdfs-trunk/587/

###################################################################################
########################## LAST 60 LINES OF THE CONSOLE ###########################
[...truncated 708813 lines...]
    [mkdir] Created dir: /grid/0/hudson/hudson-slave/workspace/Hadoop-Hdfs-trunk/trunk/build/contrib/hdfsproxy/target
     [echo]  Including clover.jar in the war file ...
[cactifywar] Analyzing war: /grid/0/hudson/hudson-slave/workspace/Hadoop-Hdfs-trunk/trunk/build/contrib/hdfsproxy/hdfsproxy-2.0-test.war
[cactifywar] Building war: /grid/0/hudson/hudson-slave/workspace/Hadoop-Hdfs-trunk/trunk/build/contrib/hdfsproxy/target/test.war

cactifywar:

test-cactus:
     [echo]  Free Ports: startup-22991 / http-22992 / https-22993
     [echo] Please take a deep breath while Cargo gets the Tomcat for running the servlet
tests...
    [mkdir] Created dir: /grid/0/hudson/hudson-slave/workspace/Hadoop-Hdfs-trunk/trunk/build/contrib/hdfsproxy/target/tomcat-config
    [mkdir] Created dir: /grid/0/hudson/hudson-slave/workspace/Hadoop-Hdfs-trunk/trunk/build/contrib/hdfsproxy/target/tomcat-config/conf
    [mkdir] Created dir: /grid/0/hudson/hudson-slave/workspace/Hadoop-Hdfs-trunk/trunk/build/contrib/hdfsproxy/target/tomcat-config/webapps
    [mkdir] Created dir: /grid/0/hudson/hudson-slave/workspace/Hadoop-Hdfs-trunk/trunk/build/contrib/hdfsproxy/target/tomcat-config/temp
    [mkdir] Created dir: /grid/0/hudson/hudson-slave/workspace/Hadoop-Hdfs-trunk/trunk/build/contrib/hdfsproxy/target/logs
    [mkdir] Created dir: /grid/0/hudson/hudson-slave/workspace/Hadoop-Hdfs-trunk/trunk/build/contrib/hdfsproxy/target/reports
     [copy] Copying 1 file to /grid/0/hudson/hudson-slave/workspace/Hadoop-Hdfs-trunk/trunk/build/contrib/hdfsproxy/target/tomcat-config/conf
     [copy] Copying 1 file to /grid/0/hudson/hudson-slave/workspace/Hadoop-Hdfs-trunk/trunk/build/contrib/hdfsproxy/target/tomcat-config/conf
     [copy] Copying 1 file to /grid/0/hudson/hudson-slave/workspace/Hadoop-Hdfs-trunk/trunk/build/contrib/hdfsproxy/target/tomcat-config/conf
   [cactus] -----------------------------------------------------------------
   [cactus] Running tests against Tomcat 5.x @ http://localhost:22992
   [cactus] -----------------------------------------------------------------
   [cactus] Deploying [/grid/0/hudson/hudson-slave/workspace/Hadoop-Hdfs-trunk/trunk/build/contrib/hdfsproxy/target/test.war]
to [/grid/0/hudson/hudson-slave/workspace/Hadoop-Hdfs-trunk/trunk/build/contrib/hdfsproxy/target/tomcat-config/webapps]...
   [cactus] Tomcat 5.x starting...
Server [Apache-Coyote/1.1] started
   [cactus] WARNING: multiple versions of ant detected in path for junit 
   [cactus]          jar:file:/homes/hudson/tools/ant/latest/lib/ant.jar!/org/apache/tools/ant/Project.class
   [cactus]      and jar:file:/homes/hudson/.ivy2/cache/ant/ant/jars/ant-1.6.5.jar!/org/apache/tools/ant/Project.class
   [cactus] Running org.apache.hadoop.hdfsproxy.TestAuthorizationFilter
   [cactus] Tests run: 4, Failures: 2, Errors: 0, Time elapsed: 0.465 sec
   [cactus] Test org.apache.hadoop.hdfsproxy.TestAuthorizationFilter FAILED
   [cactus] Running org.apache.hadoop.hdfsproxy.TestLdapIpDirFilter
   [cactus] Tests run: 2, Failures: 0, Errors: 0, Time elapsed: 0.524 sec
   [cactus] Tomcat 5.x started on port [22992]
   [cactus] Running org.apache.hadoop.hdfsproxy.TestProxyFilter
   [cactus] Tests run: 2, Failures: 0, Errors: 0, Time elapsed: 0.361 sec
   [cactus] Running org.apache.hadoop.hdfsproxy.TestProxyForwardServlet
   [cactus] Tests run: 2, Failures: 0, Errors: 0, Time elapsed: 0.325 sec
   [cactus] Running org.apache.hadoop.hdfsproxy.TestProxyUtil
   [cactus] Tests run: 1, Failures: 0, Errors: 0, Time elapsed: 0.899 sec
   [cactus] Tomcat 5.x is stopping...
   [cactus] Tomcat 5.x is stopped

BUILD FAILED
/grid/0/hudson/hudson-slave/workspace/Hadoop-Hdfs-trunk/trunk/build.xml:750: The following
error occurred while executing this line:
/grid/0/hudson/hudson-slave/workspace/Hadoop-Hdfs-trunk/trunk/build.xml:731: The following
error occurred while executing this line:
/grid/0/hudson/hudson-slave/workspace/Hadoop-Hdfs-trunk/trunk/src/contrib/build.xml:48: The
following error occurred while executing this line:
/grid/0/hudson/hudson-slave/workspace/Hadoop-Hdfs-trunk/trunk/src/contrib/hdfsproxy/build.xml:343:
Tests failed!

Total time: 51 minutes 21 seconds
[FINDBUGS] Skipping publisher since build result is FAILURE
Publishing Javadoc
Archiving artifacts
Recording test results
Recording fingerprints
Publishing Clover coverage report...
No Clover report will be published due to a Build Failure
Email was triggered for: Failure
Sending email for trigger: Failure



###################################################################################
############################## FAILED TESTS (if any) ##############################
2 tests failed.
FAILED:  org.apache.hadoop.hdfsproxy.TestAuthorizationFilter.testPathPermit

Error Message:
expected:<403> but was:<200>

Stack Trace:
junit.framework.AssertionFailedError: expected:<403> but was:<200>
	at org.apache.hadoop.hdfsproxy.TestAuthorizationFilter.endPathPermit(TestAuthorizationFilter.java:113)
	at org.apache.cactus.internal.client.ClientTestCaseCaller.callGenericEndMethod(ClientTestCaseCaller.java:442)
	at org.apache.cactus.internal.client.ClientTestCaseCaller.callEndMethod(ClientTestCaseCaller.java:209)
	at org.apache.cactus.internal.client.ClientTestCaseCaller.runTest(ClientTestCaseCaller.java:149)
	at org.apache.cactus.internal.AbstractCactusTestCase.runBareClient(AbstractCactusTestCase.java:218)
	at org.apache.cactus.internal.AbstractCactusTestCase.runBare(AbstractCactusTestCase.java:134)


FAILED:  org.apache.hadoop.hdfsproxy.TestAuthorizationFilter.testPathPermitQualified

Error Message:
expected:<403> but was:<200>

Stack Trace:
junit.framework.AssertionFailedError: expected:<403> but was:<200>
	at org.apache.hadoop.hdfsproxy.TestAuthorizationFilter.endPathPermitQualified(TestAuthorizationFilter.java:136)
	at org.apache.cactus.internal.client.ClientTestCaseCaller.callGenericEndMethod(ClientTestCaseCaller.java:442)
	at org.apache.cactus.internal.client.ClientTestCaseCaller.callEndMethod(ClientTestCaseCaller.java:209)
	at org.apache.cactus.internal.client.ClientTestCaseCaller.runTest(ClientTestCaseCaller.java:149)
	at org.apache.cactus.internal.AbstractCactusTestCase.runBareClient(AbstractCactusTestCase.java:218)
	at org.apache.cactus.internal.AbstractCactusTestCase.runBare(AbstractCactusTestCase.java:134)




Mime
View raw message