hadoop-hdfs-dev mailing list archives

Site index · List index
Message view « Date » · « Thread »
Top « Date » · « Thread »
From Apache Hudson Server <hud...@hudson.apache.org>
Subject Hadoop-Hdfs-22-branch - Build # 18 - Still Failing
Date Tue, 01 Feb 2011 10:31:53 GMT
See https://hudson.apache.org/hudson/job/Hadoop-Hdfs-22-branch/18/

###################################################################################
########################## LAST 60 LINES OF THE CONSOLE ###########################
[...truncated 1027 lines...]
    [mkdir] Created dir: /grid/0/hudson/hudson-slave/workspace/Hadoop-Hdfs-22-branch/trunk/build/webapps/datanode/WEB-INF
    [mkdir] Created dir: /grid/0/hudson/hudson-slave/workspace/Hadoop-Hdfs-22-branch/trunk/build/webapps/secondary/WEB-INF
    [mkdir] Created dir: /grid/0/hudson/hudson-slave/workspace/Hadoop-Hdfs-22-branch/trunk/build/ant
    [mkdir] Created dir: /grid/0/hudson/hudson-slave/workspace/Hadoop-Hdfs-22-branch/trunk/build/c++
    [mkdir] Created dir: /grid/0/hudson/hudson-slave/workspace/Hadoop-Hdfs-22-branch/trunk/build/test
    [mkdir] Created dir: /grid/0/hudson/hudson-slave/workspace/Hadoop-Hdfs-22-branch/trunk/build/test/hdfs/classes
    [mkdir] Created dir: /grid/0/hudson/hudson-slave/workspace/Hadoop-Hdfs-22-branch/trunk/build/test/extraconf
    [touch] Creating /tmp/null1831926762
   [delete] Deleting: /tmp/null1831926762
     [copy] Copying 3 files to /grid/0/hudson/hudson-slave/workspace/Hadoop-Hdfs-22-branch/trunk/build/webapps
     [copy] Copying 1 file to /grid/0/hudson/hudson-slave/workspace/Hadoop-Hdfs-22-branch/trunk/conf
     [copy] Copying /grid/0/hudson/hudson-slave/workspace/Hadoop-Hdfs-22-branch/trunk/conf/hdfs-site.xml.template
to /grid/0/hudson/hudson-slave/workspace/Hadoop-Hdfs-22-branch/trunk/conf/hdfs-site.xml
    [mkdir] Created dir: /grid/0/hudson/hudson-slave/workspace/Hadoop-Hdfs-22-branch/trunk/build/test/conf
     [copy] Copying 1 file to /grid/0/hudson/hudson-slave/workspace/Hadoop-Hdfs-22-branch/trunk/build/test/conf
     [copy] Copying /grid/0/hudson/hudson-slave/workspace/Hadoop-Hdfs-22-branch/trunk/conf/hdfs-site.xml.template
to /grid/0/hudson/hudson-slave/workspace/Hadoop-Hdfs-22-branch/trunk/build/test/conf/hdfs-site.xml

compile-hdfs-classes:
    [javac] Compiling 210 source files to /grid/0/hudson/hudson-slave/workspace/Hadoop-Hdfs-22-branch/trunk/build/classes
    [javac] /grid/0/hudson/hudson-slave/workspace/Hadoop-Hdfs-22-branch/trunk/src/java/org/apache/hadoop/hdfs/server/namenode/SecondaryNameNode.java:200:
cannot find symbol
    [javac] symbol  : method get(int)
    [javac] location: class java.lang.String[]
    [javac]                 Krb5AndCertsSslSocketConnector.KRB5_CIPHER_SUITES.get(0));
    [javac]                                                                  ^
    [javac] /grid/0/hudson/hudson-slave/workspace/Hadoop-Hdfs-22-branch/trunk/src/java/org/apache/hadoop/hdfs/tools/DFSck.java:200:
cannot find symbol
    [javac] symbol  : method get(int)
    [javac] location: class java.lang.String[]
    [javac]           Krb5AndCertsSslSocketConnector.KRB5_CIPHER_SUITES.get(0));
    [javac]                                                            ^
    [javac] Note: Some input files use or override a deprecated API.
    [javac] Note: Recompile with -Xlint:deprecation for details.
    [javac] 2 errors

BUILD FAILED
/grid/0/hudson/hudson-slave/workspace/Hadoop-Hdfs-22-branch/trunk/build.xml:345: Compile failed;
see the compiler error output for details.

Total time: 11 seconds


======================================================================
======================================================================
STORE: saving artifacts
======================================================================
======================================================================


mv: cannot stat `build/*.tar.gz': No such file or directory
mv: cannot stat `build/*.jar': No such file or directory
mv: cannot stat `build/test/findbugs': No such file or directory
mv: cannot stat `build/docs/api': No such file or directory
Build Failed
[FINDBUGS] Skipping publisher since build result is FAILURE
Publishing Javadoc
Archiving artifacts
Recording test results
Recording fingerprints
Publishing Clover coverage report...
No Clover report will be published due to a Build Failure
Email was triggered for: Failure
Sending email for trigger: Failure



###################################################################################
############################## FAILED TESTS (if any) ##############################
No tests ran.

Mime
View raw message