hadoop-hdfs-dev mailing list archives

Site index · List index
Message view « Date » · « Thread »
Top « Date » · « Thread »
From Apache Hudson Server <hud...@hudson.apache.org>
Subject Hadoop-Hdfs-trunk-Commit - Build # 537 - Failure
Date Wed, 09 Feb 2011 08:01:48 GMT
See https://hudson.apache.org/hudson/job/Hadoop-Hdfs-trunk-Commit/537/

###################################################################################
########################## LAST 60 LINES OF THE CONSOLE ###########################
[...truncated 3636 lines...]
    [junit] 2011-02-09 07:56:58,566 INFO  namenode.FSImage (FSImageFormat.java:save(481))
- Saving image file /grid/0/hudson/hudson-slave/workspace/Hadoop-Hdfs-trunk-Commit/trunk/build/test/data/dfs/name/current/fsimage
using no compression
    [junit] 2011-02-09 07:56:58,569 INFO  namenode.FSImage (FSImageFormat.java:save(505))
- Image file of size 113 saved in 0 seconds.
    [junit] 2011-02-09 07:56:58,570 DEBUG namenode.FSNamesystem (EditLogFileOutputStream.java:preallocate(173))
- Preallocating Edit log, current size 0
    [junit] 2011-02-09 07:56:58,570 DEBUG namenode.FSNamesystem (EditLogFileOutputStream.java:preallocate(180))
- Edit log size is now 1049088 written 512 bytes  at offset 1048576
    [junit] 2011-02-09 07:56:58,575 INFO  namenode.FSImage (FSImage.java:formatOccurred(1171))
- Storage directory /grid/0/hudson/hudson-slave/workspace/Hadoop-Hdfs-trunk-Commit/trunk/build/test/data/dfs/name
has been successfully formatted.
    [junit] 2011-02-09 07:56:58,576 DEBUG namenode.FSNamesystem (EditLogFileOutputStream.java:preallocate(173))
- Preallocating Edit log, current size 0
    [junit] 2011-02-09 07:56:58,576 DEBUG namenode.FSNamesystem (EditLogFileOutputStream.java:preallocate(180))
- Edit log size is now 1049088 written 512 bytes  at offset 1048576
    [junit] 2011-02-09 07:56:58,581 INFO  namenode.NNStorage (NNStorage.java:format(562))
- Storage directory /grid/0/hudson/hudson-slave/workspace/Hadoop-Hdfs-trunk-Commit/trunk/build/test/data/dfs/name
has been successfully formatted.
    [junit] 2011-02-09 07:56:58,582 INFO  namenode.FSNamesystem (BlockManager.java:setConfigurationParameters(171))
- defaultReplication = 3
    [junit] 2011-02-09 07:56:58,582 INFO  namenode.FSNamesystem (BlockManager.java:setConfigurationParameters(172))
- maxReplication = 512
    [junit] 2011-02-09 07:56:58,582 INFO  namenode.FSNamesystem (BlockManager.java:setConfigurationParameters(173))
- minReplication = 1
    [junit] 2011-02-09 07:56:58,583 INFO  namenode.FSNamesystem (BlockManager.java:setConfigurationParameters(174))
- maxReplicationStreams = 2
    [junit] 2011-02-09 07:56:58,583 INFO  namenode.FSNamesystem (BlockManager.java:setConfigurationParameters(175))
- shouldCheckForEnoughRacks = false
    [junit] 2011-02-09 07:56:58,583 INFO  util.GSet (BlocksMap.java:computeCapacity(84)) -
VM type       = 32-bit
    [junit] 2011-02-09 07:56:58,584 INFO  util.GSet (BlocksMap.java:computeCapacity(85)) -
2% max memory = 9.86125 MB
    [junit] 2011-02-09 07:56:58,584 INFO  util.GSet (BlocksMap.java:computeCapacity(86)) -
capacity      = 2^21 = 2097152 entries
    [junit] 2011-02-09 07:56:58,584 INFO  util.GSet (LightWeightGSet.java:<init>(82))
- recommended=2097152, actual=2097152
    [junit] 2011-02-09 07:56:58,588 INFO  namenode.FSNamesystem (FSNamesystem.java:setConfigurationParameters(463))
- fsOwner=hudson
    [junit] 2011-02-09 07:56:58,588 INFO  namenode.FSNamesystem (FSNamesystem.java:setConfigurationParameters(469))
- supergroup=supergroup
    [junit] 2011-02-09 07:56:58,588 INFO  namenode.FSNamesystem (FSNamesystem.java:setConfigurationParameters(470))
- isPermissionEnabled=false
    [junit] 2011-02-09 07:56:58,589 INFO  namenode.FSNamesystem (FSNamesystem.java:setConfigurationParameters(511))
- isBlockTokenEnabled=false blockKeyUpdateInterval=0 min(s), blockTokenLifetime=0 min(s)
    [junit] 2011-02-09 07:56:58,590 INFO  metrics.FSNamesystemMetrics (FSNamesystemMetrics.java:<init>(80))
- Initializing FSNamesystemMetrics using context object:org.apache.hadoop.metrics.spi.NullContext
    [junit] 2011-02-09 07:56:58,590 INFO  namenode.FSNamesystem (FSNamesystem.java:registerMBean(4530))
- Registered FSNamesystemStatusMBean
    [junit] 2011-02-09 07:56:58,591 INFO  namenode.NameNode (FSDirectory.java:<init>(125))
- Caching file names occuring more than 10 times 
    [junit] 2011-02-09 07:56:58,591 WARN  common.Util (Util.java:stringAsURI(63)) - Path /grid/0/hudson/hudson-slave/workspace/Hadoop-Hdfs-trunk-Commit/trunk/build/test/data/dfs/name
should be specified as a URI in configuration files. Please update hdfs configuration.
    [junit] 2011-02-09 07:56:58,592 WARN  common.Util (Util.java:stringAsURI(63)) - Path /grid/0/hudson/hudson-slave/workspace/Hadoop-Hdfs-trunk-Commit/trunk/build/test/data/dfs/name
should be specified as a URI in configuration files. Please update hdfs configuration.
    [junit] 2011-02-09 07:56:58,593 INFO  namenode.FSImage (FSImageFormat.java:load(178))
- Loading image file /grid/0/hudson/hudson-slave/workspace/Hadoop-Hdfs-trunk-Commit/trunk/build/test/data/dfs/name/current/fsimage
using no compression
    [junit] 2011-02-09 07:56:58,593 INFO  namenode.FSImage (FSImageFormat.java:load(181))
- Number of files = 1
    [junit] 2011-02-09 07:56:58,593 INFO  namenode.FSImage (FSImageFormat.java:loadFilesUnderConstruction(349))
- Number of files under construction = 0
    [junit] 2011-02-09 07:56:58,594 INFO  namenode.FSImage (FSImageFormat.java:load(202))
- Image file of size 113 loaded in 0 seconds.
    [junit] 2011-02-09 07:56:58,594 INFO  namenode.FSImage (FSEditLogLoader.java:loadFSEdits(60))
- Edits file /grid/0/hudson/hudson-slave/workspace/Hadoop-Hdfs-trunk-Commit/trunk/build/test/data/dfs/name/current/edits
of size 4 edits # 0 loaded in 0 seconds.
    [junit] 2011-02-09 07:56:58,595 INFO  namenode.NameCache (NameCache.java:initialized(143))
- initialized with 0 entries 0 lookups
    [junit] 2011-02-09 07:56:58,595 INFO  namenode.FSNamesystem (FSNamesystem.java:initialize(311))
- Finished loading FSImage in 14 msecs
    [junit] 2011-02-09 07:56:58,596 INFO  util.HostsFileReader (HostsFileReader.java:refresh(85))
- Refreshing hosts (include/exclude) list
    [junit] 2011-02-09 07:56:58,596 DEBUG namenode.TestNNLeaseRecovery (TestNNLeaseRecovery.java:__CLR3_0_2q30srswws(363))
- Running __CLR3_0_2q30srswws
    [junit] 2011-02-09 07:56:58,598 INFO  namenode.FSEditLog (FSEditLog.java:printStatistics(559))
- Number of transactions: 0 Total time for transactions(ms): 0Number of transactions batched
in Syncs: 0 Number of syncs: 0 SyncTimes(ms): 0 
    [junit] 2011-02-09 07:56:58,598 DEBUG namenode.FSNamesystem (EditLogFileOutputStream.java:preallocate(173))
- Preallocating Edit log, current size 4
    [junit] 2011-02-09 07:56:58,598 DEBUG namenode.FSNamesystem (EditLogFileOutputStream.java:preallocate(180))
- Edit log size is now 1049092 written 512 bytes  at offset 1048580
    [junit] 2011-02-09 07:56:58,605 INFO  namenode.FSNamesystem (FSNamesystem.java:commitBlockSynchronization(2338))
- commitBlockSynchronization(lastblock=Mock for BlockInfoUnderConstruction, hashCode: 9135999,
newgenerationstamp=2002, newlength=273487234, newtargets=[null], closeFile=true, deleteBlock=false)
    [junit] Tests run: 11, Failures: 0, Errors: 0, Time elapsed: 2.711 sec

checkfailure:
    [touch] Creating /grid/0/hudson/hudson-slave/workspace/Hadoop-Hdfs-trunk-Commit/trunk/build/test/testsfailed

BUILD FAILED
/grid/0/hudson/hudson-slave/workspace/Hadoop-Hdfs-trunk-Commit/trunk/build.xml:696: The following
error occurred while executing this line:
/grid/0/hudson/hudson-slave/workspace/Hadoop-Hdfs-trunk-Commit/trunk/build.xml:659: The following
error occurred while executing this line:
/grid/0/hudson/hudson-slave/workspace/Hadoop-Hdfs-trunk-Commit/trunk/build.xml:727: Tests
failed!

Total time: 15 minutes 28 seconds
[FINDBUGS] Skipping publisher since build result is FAILURE
Recording fingerprints
Archiving artifacts
Recording test results
Publishing Javadoc
Publishing Clover coverage report...
No Clover report will be published due to a Build Failure
Email was triggered for: Failure
Sending email for trigger: Failure



###################################################################################
############################## FAILED TESTS (if any) ##############################
1 tests failed.
REGRESSION:  org.apache.hadoop.hdfs.server.datanode.TestBlockRecovery.testErrorReplicas

Error Message:
Timeout occurred. Please note the time in the report does not reflect the time until the timeout.

Stack Trace:
junit.framework.AssertionFailedError: Timeout occurred. Please note the time in the report
does not reflect the time until the timeout.




Mime
View raw message