hadoop-hdfs-dev mailing list archives

Site index · List index
Message view « Date » · « Thread »
Top « Date » · « Thread »
From Apache Hudson Server <hud...@hudson.apache.org>
Subject Hadoop-Hdfs-trunk-Commit - Build # 546 - Failure
Date Thu, 24 Feb 2011 20:29:35 GMT
See https://hudson.apache.org/hudson/job/Hadoop-Hdfs-trunk-Commit/546/

###################################################################################
########################## LAST 60 LINES OF THE CONSOLE ###########################
[...truncated 2684 lines...]
   [clover] Processing files at 1.6 source level.
   [clover] Clover all over. Instrumented 190 files (20 packages).
   [clover] 435 test methods detected.
   [clover] Elapsed time = 1.107 secs. (171.635 files/sec, 41,129.18 srclines/sec)
    [javac] Note: Some input files use or override a deprecated API.
    [javac] Note: Recompile with -Xlint:deprecation for details.
    [mkdir] Created dir: /grid/0/hudson/hudson-slave/workspace/Hadoop-Hdfs-trunk-Commit/trunk/build/test/cache
     [copy] Copying 1 file to /grid/0/hudson/hudson-slave/workspace/Hadoop-Hdfs-trunk-Commit/trunk/build/test/cache
     [copy] Copying 1 file to /grid/0/hudson/hudson-slave/workspace/Hadoop-Hdfs-trunk-Commit/trunk/build/test/cache
     [copy] Copying 1 file to /grid/0/hudson/hudson-slave/workspace/Hadoop-Hdfs-trunk-Commit/trunk/build/test/cache
     [copy] Copying 1 file to /grid/0/hudson/hudson-slave/workspace/Hadoop-Hdfs-trunk-Commit/trunk/build/test/cache
     [copy] Copying 1 file to /grid/0/hudson/hudson-slave/workspace/Hadoop-Hdfs-trunk-Commit/trunk/build/test/cache
     [copy] Copying 1 file to /grid/0/hudson/hudson-slave/workspace/Hadoop-Hdfs-trunk-Commit/trunk/build/test/cache
     [copy] Copying 1 file to /grid/0/hudson/hudson-slave/workspace/Hadoop-Hdfs-trunk-Commit/trunk/build/test/cache
     [copy] Copying 1 file to /grid/0/hudson/hudson-slave/workspace/Hadoop-Hdfs-trunk-Commit/trunk/build/test/cache
     [copy] Copying 1 file to /grid/0/hudson/hudson-slave/workspace/Hadoop-Hdfs-trunk-Commit/trunk/build/test/cache
     [copy] Copying 1 file to /grid/0/hudson/hudson-slave/workspace/Hadoop-Hdfs-trunk-Commit/trunk/build/test/cache
     [copy] Copying 1 file to /grid/0/hudson/hudson-slave/workspace/Hadoop-Hdfs-trunk-Commit/trunk/build/test/cache
     [copy] Copying 1 file to /grid/0/hudson/hudson-slave/workspace/Hadoop-Hdfs-trunk-Commit/trunk/build/test/cache

run-commit-test:
    [mkdir] Created dir: /grid/0/hudson/hudson-slave/workspace/Hadoop-Hdfs-trunk-Commit/trunk/build/test/data
    [mkdir] Created dir: /grid/0/hudson/hudson-slave/workspace/Hadoop-Hdfs-trunk-Commit/trunk/build/test/logs
     [copy] Copying 1 file to /grid/0/hudson/hudson-slave/workspace/Hadoop-Hdfs-trunk-Commit/trunk/build/test/extraconf
     [copy] Copying 1 file to /grid/0/hudson/hudson-slave/workspace/Hadoop-Hdfs-trunk-Commit/trunk/build/test/extraconf
    [junit] WARNING: multiple versions of ant detected in path for junit 
    [junit]          jar:file:/homes/hudson/tools/ant/latest/lib/ant.jar!/org/apache/tools/ant/Project.class
    [junit]      and jar:file:/homes/hudson/.ivy2/cache/ant/ant/jars/ant-1.6.5.jar!/org/apache/tools/ant/Project.class
    [junit] Running org.apache.hadoop.hdfs.server.datanode.TestBlockRecovery
    [junit] Running org.apache.hadoop.hdfs.server.datanode.TestBlockRecovery
    [junit] Tests run: 1, Failures: 0, Errors: 1, Time elapsed: 0 sec
    [junit] Test org.apache.hadoop.hdfs.server.datanode.TestBlockRecovery FAILED (timeout)
    [junit] Running org.apache.hadoop.hdfs.server.datanode.TestDataDirs
    [junit] Tests run: 1, Failures: 0, Errors: 0, Time elapsed: 0.542 sec
    [junit] Running org.apache.hadoop.hdfs.server.namenode.TestGetImageServlet
    [junit] Tests run: 2, Failures: 0, Errors: 0, Time elapsed: 0.485 sec
    [junit] Running org.apache.hadoop.hdfs.server.namenode.TestINodeFile
    [junit] Tests run: 6, Failures: 0, Errors: 0, Time elapsed: 0.247 sec
    [junit] Running org.apache.hadoop.hdfs.server.namenode.TestNNLeaseRecovery
    [junit] Tests run: 11, Failures: 0, Errors: 0, Time elapsed: 2.447 sec

checkfailure:
    [touch] Creating /grid/0/hudson/hudson-slave/workspace/Hadoop-Hdfs-trunk-Commit/trunk/build/test/testsfailed

BUILD FAILED
/grid/0/hudson/hudson-slave/workspace/Hadoop-Hdfs-trunk-Commit/trunk/build.xml:696: The following
error occurred while executing this line:
/grid/0/hudson/hudson-slave/workspace/Hadoop-Hdfs-trunk-Commit/trunk/build.xml:659: The following
error occurred while executing this line:
/grid/0/hudson/hudson-slave/workspace/Hadoop-Hdfs-trunk-Commit/trunk/build.xml:727: Tests
failed!

Total time: 15 minutes 27 seconds
[FINDBUGS] Skipping publisher since build result is FAILURE
Recording fingerprints
Archiving artifacts
Recording test results
Publishing Javadoc
Publishing Clover coverage report...
No Clover report will be published due to a Build Failure
Email was triggered for: Failure
Sending email for trigger: Failure



###################################################################################
############################## FAILED TESTS (if any) ##############################
1 tests failed.
REGRESSION:  org.apache.hadoop.hdfs.server.datanode.TestBlockRecovery.testErrorReplicas

Error Message:
Timeout occurred. Please note the time in the report does not reflect the time until the timeout.

Stack Trace:
junit.framework.AssertionFailedError: Timeout occurred. Please note the time in the report
does not reflect the time until the timeout.




Mime
View raw message