hadoop-hdfs-dev mailing list archives

Site index · List index
Message view « Date » · « Thread »
Top « Date » · « Thread »
From Apache Hudson Server <hud...@hudson.apache.org>
Subject Hadoop-Hdfs-trunk-Commit - Build # 530 - Still Failing
Date Fri, 04 Feb 2011 09:45:33 GMT
See https://hudson.apache.org/hudson/job/Hadoop-Hdfs-trunk-Commit/530/

###################################################################################
########################## LAST 60 LINES OF THE CONSOLE ###########################
[...truncated 74914 lines...]
    [junit] 2011-02-04 09:43:26,113 WARN  datanode.FSDatasetAsyncDiskService (FSDatasetAsyncDiskService.java:shutdown(130))
- AsyncDiskService has already shut down.
    [junit] 2011-02-04 09:43:26,114 INFO  hdfs.MiniDFSCluster (MiniDFSCluster.java:shutdownDataNodes(835))
- Shutting down DataNode 0
    [junit] 2011-02-04 09:43:26,116 INFO  ipc.Server (Server.java:stop(1610)) - Stopping server
on 41229
    [junit] 2011-02-04 09:43:26,116 INFO  ipc.Server (Server.java:run(1443)) - IPC Server
handler 1 on 41229: exiting
    [junit] 2011-02-04 09:43:26,116 INFO  ipc.Server (Server.java:run(1443)) - IPC Server
handler 2 on 41229: exiting
    [junit] 2011-02-04 09:43:26,116 INFO  ipc.Server (Server.java:run(1443)) - IPC Server
handler 0 on 41229: exiting
    [junit] 2011-02-04 09:43:26,117 INFO  ipc.Server (Server.java:run(475)) - Stopping IPC
Server listener on 41229
    [junit] 2011-02-04 09:43:26,117 INFO  ipc.Server (Server.java:run(675)) - Stopping IPC
Server Responder
    [junit] 2011-02-04 09:43:26,118 WARN  datanode.DataNode (DataXceiverServer.java:run(141))
- DatanodeRegistration(127.0.0.1:49309, storageID=DS-473535769-127.0.1.1-49309-1296812436935,
infoPort=47441, ipcPort=41229):DataXceiveServer: java.nio.channels.AsynchronousCloseException
    [junit] 	at java.nio.channels.spi.AbstractInterruptibleChannel.end(AbstractInterruptibleChannel.java:185)
    [junit] 	at sun.nio.ch.ServerSocketChannelImpl.accept(ServerSocketChannelImpl.java:152)
    [junit] 	at sun.nio.ch.ServerSocketAdaptor.accept(ServerSocketAdaptor.java:84)
    [junit] 	at org.apache.hadoop.hdfs.server.datanode.DataXceiverServer.run(DataXceiverServer.java:134)
    [junit] 	at java.lang.Thread.run(Thread.java:619)
    [junit] 
    [junit] 2011-02-04 09:43:26,117 INFO  datanode.DataNode (DataNode.java:shutdown(786))
- Waiting for threadgroup to exit, active threads is 1
    [junit] 2011-02-04 09:43:26,118 INFO  datanode.DataBlockScanner (DataBlockScanner.java:run(622))
- Exiting DataBlockScanner thread.
    [junit] 2011-02-04 09:43:26,119 INFO  datanode.DataNode (DataNode.java:run(1460)) - DatanodeRegistration(127.0.0.1:49309,
storageID=DS-473535769-127.0.1.1-49309-1296812436935, infoPort=47441, ipcPort=41229):Finishing
DataNode in: FSDataset{dirpath='/grid/0/hudson/hudson-slave/workspace/Hadoop-Hdfs-trunk-Commit/trunk/build/test/data/dfs/data/data1/current/finalized,/grid/0/hudson/hudson-slave/workspace/Hadoop-Hdfs-trunk-Commit/trunk/build/test/data/dfs/data/data2/current/finalized'}
    [junit] 2011-02-04 09:43:26,119 INFO  ipc.Server (Server.java:stop(1610)) - Stopping server
on 41229
    [junit] 2011-02-04 09:43:26,119 INFO  datanode.DataNode (DataNode.java:shutdown(786))
- Waiting for threadgroup to exit, active threads is 0
    [junit] 2011-02-04 09:43:26,119 INFO  datanode.FSDatasetAsyncDiskService (FSDatasetAsyncDiskService.java:shutdown(133))
- Shutting down all async disk service threads...
    [junit] 2011-02-04 09:43:26,120 INFO  datanode.FSDatasetAsyncDiskService (FSDatasetAsyncDiskService.java:shutdown(142))
- All async disk service threads have been shut down.
    [junit] 2011-02-04 09:43:26,120 WARN  datanode.FSDatasetAsyncDiskService (FSDatasetAsyncDiskService.java:shutdown(130))
- AsyncDiskService has already shut down.
    [junit] 2011-02-04 09:43:26,222 WARN  namenode.FSNamesystem (FSNamesystem.java:run(2847))
- ReplicationMonitor thread received InterruptedException.java.lang.InterruptedException:
sleep interrupted
    [junit] 2011-02-04 09:43:26,222 WARN  namenode.DecommissionManager (DecommissionManager.java:run(70))
- Monitor interrupted: java.lang.InterruptedException: sleep interrupted
    [junit] 2011-02-04 09:43:26,223 INFO  namenode.FSEditLog (FSEditLog.java:printStatistics(559))
- Number of transactions: 12 Total time for transactions(ms): 1Number of transactions batched
in Syncs: 1 Number of syncs: 9 SyncTimes(ms): 6 6 
    [junit] 2011-02-04 09:43:26,224 INFO  ipc.Server (Server.java:stop(1610)) - Stopping server
on 34088
    [junit] 2011-02-04 09:43:26,235 INFO  ipc.Server (Server.java:run(1443)) - IPC Server
handler 0 on 34088: exiting
    [junit] 2011-02-04 09:43:26,236 INFO  ipc.Server (Server.java:run(1443)) - IPC Server
handler 2 on 34088: exiting
    [junit] 2011-02-04 09:43:26,236 INFO  ipc.Server (Server.java:run(1443)) - IPC Server
handler 9 on 34088: exiting
    [junit] 2011-02-04 09:43:26,236 INFO  ipc.Server (Server.java:run(1443)) - IPC Server
handler 7 on 34088: exiting
    [junit] 2011-02-04 09:43:26,235 INFO  ipc.Server (Server.java:run(1443)) - IPC Server
handler 1 on 34088: exiting
    [junit] 2011-02-04 09:43:26,236 INFO  ipc.Server (Server.java:run(1443)) - IPC Server
handler 5 on 34088: exiting
    [junit] 2011-02-04 09:43:26,236 INFO  ipc.Server (Server.java:run(1443)) - IPC Server
handler 6 on 34088: exiting
    [junit] 2011-02-04 09:43:26,236 INFO  ipc.Server (Server.java:run(1443)) - IPC Server
handler 8 on 34088: exiting
    [junit] 2011-02-04 09:43:26,236 INFO  ipc.Server (Server.java:run(475)) - Stopping IPC
Server listener on 34088
    [junit] 2011-02-04 09:43:26,236 INFO  ipc.Server (Server.java:run(1443)) - IPC Server
handler 3 on 34088: exiting
    [junit] 2011-02-04 09:43:26,236 INFO  ipc.Server (Server.java:run(675)) - Stopping IPC
Server Responder
    [junit] 2011-02-04 09:43:26,236 INFO  ipc.Server (Server.java:run(1443)) - IPC Server
handler 4 on 34088: exiting
    [junit] Tests run: 3, Failures: 0, Errors: 0, Time elapsed: 573.042 sec

checkfailure:
    [touch] Creating /grid/0/hudson/hudson-slave/workspace/Hadoop-Hdfs-trunk-Commit/trunk/build/test/testsfailed

BUILD FAILED
/grid/0/hudson/hudson-slave/workspace/Hadoop-Hdfs-trunk-Commit/trunk/build.xml:702: The following
error occurred while executing this line:
/grid/0/hudson/hudson-slave/workspace/Hadoop-Hdfs-trunk-Commit/trunk/build.xml:659: The following
error occurred while executing this line:
/grid/0/hudson/hudson-slave/workspace/Hadoop-Hdfs-trunk-Commit/trunk/build.xml:727: Tests
failed!

Total time: 347 minutes 1 second
[FINDBUGS] Skipping publisher since build result is FAILURE
Recording fingerprints
Archiving artifacts
Recording test results
Publishing Javadoc
Publishing Clover coverage report...
No Clover report will be published due to a Build Failure
Email was triggered for: Failure
Sending email for trigger: Failure



###################################################################################
############################## FAILED TESTS (if any) ##############################
13 tests failed.
FAILED:  org.apache.hadoop.hdfs.server.namenode.TestBackupNode.testCheckpoint

Error Message:
Timeout occurred. Please note the time in the report does not reflect the time until the timeout.

Stack Trace:
junit.framework.AssertionFailedError: Timeout occurred. Please note the time in the report
does not reflect the time until the timeout.


FAILED:  org.apache.hadoop.hdfs.server.namenode.TestCheckpoint.testCheckpoint

Error Message:
Timeout occurred. Please note the time in the report does not reflect the time until the timeout.

Stack Trace:
junit.framework.AssertionFailedError: Timeout occurred. Please note the time in the report
does not reflect the time until the timeout.


FAILED:  org.apache.hadoop.hdfs.server.namenode.TestStorageRestore.testStorageRestore

Error Message:
Image file /grid/0/hudson/hudson-slave/workspace/Hadoop-Hdfs-trunk-Commit/trunk/build/test/data/dfs/secondary/current/fsimage
is corrupt with MD5 checksum of 37c2659e3ffd9a6350bb67b4a6842dea but expecting 254392d045f4f447825780b60cc760eb

Stack Trace:
java.io.IOException: Image file /grid/0/hudson/hudson-slave/workspace/Hadoop-Hdfs-trunk-Commit/trunk/build/test/data/dfs/secondary/current/fsimage
is corrupt with MD5 checksum of 37c2659e3ffd9a6350bb67b4a6842dea but expecting 254392d045f4f447825780b60cc760eb
	at org.apache.hadoop.hdfs.server.namenode.FSImage.loadFSImage(FSImage.java:670)
	at org.apache.hadoop.hdfs.server.namenode.SecondaryNameNode$CheckpointStorage.doMerge(SecondaryNameNode.java:710)
	at org.apache.hadoop.hdfs.server.namenode.SecondaryNameNode$CheckpointStorage.access$500(SecondaryNameNode.java:603)
	at org.apache.hadoop.hdfs.server.namenode.SecondaryNameNode.doMerge(SecondaryNameNode.java:480)
	at org.apache.hadoop.hdfs.server.namenode.SecondaryNameNode.doCheckpoint(SecondaryNameNode.java:441)
	at org.apache.hadoop.hdfs.server.namenode.TestStorageRestore.__CLR3_0_2dn2tm4ru8(TestStorageRestore.java:316)
	at org.apache.hadoop.hdfs.server.namenode.TestStorageRestore.testStorageRestore(TestStorageRestore.java:286)


FAILED:  org.apache.hadoop.hdfs.TestDFSShell.testErrOutPut

Error Message:
Timeout occurred. Please note the time in the report does not reflect the time until the timeout.

Stack Trace:
junit.framework.AssertionFailedError: Timeout occurred. Please note the time in the report
does not reflect the time until the timeout.


FAILED:  org.apache.hadoop.hdfs.TestDFSUpgradeFromImage.testUpgradeFromImage

Error Message:
Timeout occurred. Please note the time in the report does not reflect the time until the timeout.

Stack Trace:
junit.framework.AssertionFailedError: Timeout occurred. Please note the time in the report
does not reflect the time until the timeout.


FAILED:  org.apache.hadoop.hdfs.TestDistributedFileSystem.testAllWithDualPort

Error Message:
Timeout occurred. Please note the time in the report does not reflect the time until the timeout.

Stack Trace:
junit.framework.AssertionFailedError: Timeout occurred. Please note the time in the report
does not reflect the time until the timeout.


FAILED:  org.apache.hadoop.hdfs.TestFileAppend.testComplexFlush

Error Message:
Timeout occurred. Please note the time in the report does not reflect the time until the timeout.

Stack Trace:
junit.framework.AssertionFailedError: Timeout occurred. Please note the time in the report
does not reflect the time until the timeout.


FAILED:  org.apache.hadoop.hdfs.TestFileAppend2.testComplexAppend

Error Message:
Timeout occurred. Please note the time in the report does not reflect the time until the timeout.

Stack Trace:
junit.framework.AssertionFailedError: Timeout occurred. Please note the time in the report
does not reflect the time until the timeout.


FAILED:  org.apache.hadoop.hdfs.TestFileAppend3.testAppendToPartialChunk

Error Message:
Timeout occurred. Please note the time in the report does not reflect the time until the timeout.

Stack Trace:
junit.framework.AssertionFailedError: Timeout occurred. Please note the time in the report
does not reflect the time until the timeout.


FAILED:  org.apache.hadoop.hdfs.TestHDFSTrash.testTrashEmptier

Error Message:
null

Stack Trace:
junit.framework.AssertionFailedError: null
	at org.apache.hadoop.fs.TestTrash.testTrashEmptier(TestTrash.java:460)
	at junit.extensions.TestDecorator.basicRun(TestDecorator.java:24)
	at junit.extensions.TestSetup$1.protect(TestSetup.java:23)
	at junit.extensions.TestSetup.run(TestSetup.java:27)


FAILED:  org.apache.hadoop.hdfs.TestPread.testPreadDFSSimulated

Error Message:
Timeout occurred. Please note the time in the report does not reflect the time until the timeout.

Stack Trace:
junit.framework.AssertionFailedError: Timeout occurred. Please note the time in the report
does not reflect the time until the timeout.


FAILED:  org.apache.hadoop.hdfs.TestQuota.testMultipleFilesSmallerThanOneBlock

Error Message:
Timeout occurred. Please note the time in the report does not reflect the time until the timeout.

Stack Trace:
junit.framework.AssertionFailedError: Timeout occurred. Please note the time in the report
does not reflect the time until the timeout.


FAILED:  org.apache.hadoop.hdfs.TestRestartDFS.testRestartDualPortDFS

Error Message:
Timeout occurred. Please note the time in the report does not reflect the time until the timeout.

Stack Trace:
junit.framework.AssertionFailedError: Timeout occurred. Please note the time in the report
does not reflect the time until the timeout.




Mime
View raw message