hadoop-hdfs-dev mailing list archives

Site index · List index
Message view « Date » · « Thread »
Top « Date » · « Thread »
From Apache Hudson Server <hud...@hudson.apache.org>
Subject Hadoop-Hdfs-22-branch - Build # 20 - Still Failing
Date Fri, 04 Feb 2011 23:02:53 GMT
See https://hudson.apache.org/hudson/job/Hadoop-Hdfs-22-branch/20/

###################################################################################
########################## LAST 60 LINES OF THE CONSOLE ###########################
[...truncated 2945 lines...]
    [junit] Running org.apache.hadoop.hdfs.TestDFSClientRetries
    [junit] Tests run: 5, Failures: 0, Errors: 0, Time elapsed: 45.561 sec
    [junit] Running org.apache.hadoop.hdfs.TestDFSPermission
    [junit] Tests run: 3, Failures: 0, Errors: 0, Time elapsed: 17.075 sec
    [junit] Running org.apache.hadoop.hdfs.TestDFSRemove
    [junit] Tests run: 1, Failures: 0, Errors: 0, Time elapsed: 14.212 sec
    [junit] Running org.apache.hadoop.hdfs.TestDFSStartupVersions
    [junit] Tests run: 1, Failures: 0, Errors: 0, Time elapsed: 17.938 sec
    [junit] Running org.apache.hadoop.hdfs.TestDFSUpgrade
    [junit] Tests run: 1, Failures: 0, Errors: 0, Time elapsed: 24.749 sec
    [junit] Running org.apache.hadoop.hdfs.TestDFSUtil
    [junit] Tests run: 1, Failures: 0, Errors: 0, Time elapsed: 0.174 sec
    [junit] Running org.apache.hadoop.hdfs.TestDatanodeBlockScanner
    [junit] Tests run: 4, Failures: 0, Errors: 0, Time elapsed: 94.131 sec
    [junit] Running org.apache.hadoop.hdfs.TestDatanodeConfig
    [junit] Tests run: 1, Failures: 0, Errors: 0, Time elapsed: 2.632 sec
    [junit] Running org.apache.hadoop.hdfs.TestDatanodeDeath
    [junit] Tests run: 4, Failures: 0, Errors: 0, Time elapsed: 120.056 sec
    [junit] Running org.apache.hadoop.hdfs.TestDatanodeRegistration
    [junit] Tests run: 1, Failures: 0, Errors: 0, Time elapsed: 3.998 sec
    [junit] Running org.apache.hadoop.hdfs.TestDecommission
    [junit] Tests run: 1, Failures: 0, Errors: 0, Time elapsed: 32.312 sec
    [junit] Running org.apache.hadoop.hdfs.TestDeprecatedKeys
    [junit] Tests run: 1, Failures: 0, Errors: 0, Time elapsed: 0.266 sec
    [junit] Running org.apache.hadoop.hdfs.TestDfsOverAvroRpc
    [junit] Tests run: 1, Failures: 0, Errors: 0, Time elapsed: 3.849 sec
    [junit] Running org.apache.hadoop.hdfs.TestFileAppend4
    [junit] Tests run: 2, Failures: 0, Errors: 0, Time elapsed: 9.607 sec
    [junit] Running org.apache.hadoop.hdfs.TestFileConcurrentReader
    [junit] Tests run: 7, Failures: 0, Errors: 0, Time elapsed: 26.07 sec
    [junit] Running org.apache.hadoop.hdfs.TestFileCreation
    [junit] Tests run: 12, Failures: 0, Errors: 0, Time elapsed: 47.328 sec
    [junit] Running org.apache.hadoop.hdfs.TestFileCreationClient
    [junit] Tests run: 1, Failures: 0, Errors: 0, Time elapsed: 9.435 sec
    [junit] Running org.apache.hadoop.hdfs.TestFileCreationDelete
    [junit] Tests run: 1, Failures: 0, Errors: 0, Time elapsed: 12.961 sec
    [junit] Running org.apache.hadoop.hdfs.TestFileCreationEmpty
    [junit] Tests run: 1, Failures: 0, Errors: 0, Time elapsed: 8.137 sec
    [junit] Running org.apache.hadoop.hdfs.TestHDFSFileSystemContract
    [junit] Tests run: 28, Failures: 0, Errors: 0, Time elapsed: 33.897 sec
    [junit] Running org.apache.hadoop.hdfs.TestHFlush
    [junit] Tests run: 5, Failures: 0, Errors: 0, Time elapsed: 19.459 sec
    [junit] Running org.apache.hadoop.hdfs.TestHftpFileSystem
    [junit] Tests run: 3, Failures: 0, Errors: 0, Time elapsed: 2.932 sec
    [junit] Running org.apache.hadoop.hdfs.TestInjectionForSimulatedStorage
    [junit] Tests run: 1, Failures: 0, Errors: 0, Time elapsed: 13.84 sec
    [junit] Running org.apache.hadoop.hdfs.TestLargeBlock
    [junit] Tests run: 1, Failures: 0, Errors: 0, Time elapsed: 41.482 sec
    [junit] Running org.apache.hadoop.hdfs.TestLeaseRecovery2
Build timed out. Aborting
[FINDBUGS] Skipping publisher since build result is FAILURE
Publishing Javadoc
Archiving artifacts
Recording test results
Recording fingerprints
Publishing Clover coverage report...
No Clover report will be published due to a Build Failure
Email was triggered for: Failure
Sending email for trigger: Failure



###################################################################################
############################## FAILED TESTS (if any) ##############################
2 tests failed.
FAILED:  TEST-org.apache.hadoop.hdfs.TestLeaseRecovery2.xml.<init>

Error Message:


Stack Trace:
Test report file /grid/0/hudson/hudson-slave/workspace/Hadoop-Hdfs-22-branch/trunk/build/test/TEST-org.apache.hadoop.hdfs.TestLeaseRecovery2.xml
was length 0

FAILED:  org.apache.hadoop.hdfs.server.namenode.TestStorageRestore.testStorageRestore

Error Message:
Image file /grid/0/hudson/hudson-slave/workspace/Hadoop-Hdfs-22-branch/trunk/build/test/data/dfs/secondary/current/fsimage
is corrupt with MD5 checksum of 3ebbb7dd4967409332031e39542a773f but expecting 8d536543fc611337555a86f79d006ea8

Stack Trace:
java.io.IOException: Image file /grid/0/hudson/hudson-slave/workspace/Hadoop-Hdfs-22-branch/trunk/build/test/data/dfs/secondary/current/fsimage
is corrupt with MD5 checksum of 3ebbb7dd4967409332031e39542a773f but expecting 8d536543fc611337555a86f79d006ea8
	at org.apache.hadoop.hdfs.server.namenode.FSImage.loadFSImage(FSImage.java:1062)
	at org.apache.hadoop.hdfs.server.namenode.SecondaryNameNode$CheckpointStorage.doMerge(SecondaryNameNode.java:678)
	at org.apache.hadoop.hdfs.server.namenode.SecondaryNameNode$CheckpointStorage.access$500(SecondaryNameNode.java:583)
	at org.apache.hadoop.hdfs.server.namenode.SecondaryNameNode.doMerge(SecondaryNameNode.java:460)
	at org.apache.hadoop.hdfs.server.namenode.SecondaryNameNode.doCheckpoint(SecondaryNameNode.java:424)
	at org.apache.hadoop.hdfs.server.namenode.TestStorageRestore.__CLR3_0_2dn2tm410vf(TestStorageRestore.java:316)
	at org.apache.hadoop.hdfs.server.namenode.TestStorageRestore.testStorageRestore(TestStorageRestore.java:286)




Mime
View raw message