hadoop-hdfs-dev mailing list archives

Site index · List index
Message view « Date » · « Thread »
Top « Date » · « Thread »
From Apache Hudson Server <hud...@hudson.apache.org>
Subject Hadoop-Hdfs-trunk - Build # 582 - Still Failing
Date Mon, 14 Feb 2011 12:24:08 GMT
See https://hudson.apache.org/hudson/job/Hadoop-Hdfs-trunk/582/

###################################################################################
########################## LAST 60 LINES OF THE CONSOLE ###########################
[...truncated 694693 lines...]
    [junit] 	at org.apache.hadoop.fi.DataTransferTestUtil$SleepAction.run(DataTransferTestUtil.java:1)
    [junit] 	at org.apache.hadoop.fi.FiTestUtil$ActionContainer.run(FiTestUtil.java:116)
    [junit] 	at org.apache.hadoop.hdfs.server.datanode.BlockReceiverAspects.ajc$before$org_apache_hadoop_hdfs_server_datanode_BlockReceiverAspects$7$b9c2bffe(BlockReceiverAspects.aj:193)
    [junit] 	at org.apache.hadoop.hdfs.server.datanode.BlockReceiver.receivePacket(BlockReceiver.java:445)
    [junit] 	at org.apache.hadoop.hdfs.server.datanode.BlockReceiver.receiveBlock(BlockReceiver.java:633)
    [junit] 	at org.apache.hadoop.hdfs.server.datanode.DataXceiver.opWriteBlock(DataXceiver.java:390)
    [junit] 	at org.apache.hadoop.hdfs.protocol.DataTransferProtocol$Receiver.opWriteBlock(DataTransferProtocol.java:389)
    [junit] 	at org.apache.hadoop.hdfs.protocol.DataTransferProtocol$Receiver.processOp(DataTransferProtocol.java:331)
    [junit] 	at org.apache.hadoop.hdfs.server.datanode.DataXceiver.run(DataXceiver.java:130)
    [junit] 	at java.lang.Thread.run(Thread.java:662)
    [junit] Caused by: java.lang.InterruptedException: sleep interrupted
    [junit] 	at java.lang.Thread.sleep(Native Method)
    [junit] 	at org.apache.hadoop.fi.FiTestUtil.sleep(FiTestUtil.java:80)
    [junit] 	... 11 more
    [junit] 2011-02-14 12:23:40,358 INFO  datanode.DataNode (DataNode.java:shutdown(786))
- Waiting for threadgroup to exit, active threads is 0
    [junit] 2011-02-14 12:23:40,459 INFO  datanode.DataBlockScanner (DataBlockScanner.java:run(622))
- Exiting DataBlockScanner thread.
    [junit] 2011-02-14 12:23:40,459 INFO  datanode.DataNode (DataNode.java:run(1460)) - DatanodeRegistration(127.0.0.1:51763,
storageID=DS-1581103133-127.0.1.1-51763-1297686209769, infoPort=59454, ipcPort=44458):Finishing
DataNode in: FSDataset{dirpath='/grid/0/hudson/hudson-slave/workspace/Hadoop-Hdfs-trunk/trunk/build-fi/test/data/dfs/data/data1/current/finalized,/grid/0/hudson/hudson-slave/workspace/Hadoop-Hdfs-trunk/trunk/build-fi/test/data/dfs/data/data2/current/finalized'}
    [junit] 2011-02-14 12:23:40,459 INFO  ipc.Server (Server.java:stop(1610)) - Stopping server
on 44458
    [junit] 2011-02-14 12:23:40,459 INFO  datanode.DataNode (DataNode.java:shutdown(786))
- Waiting for threadgroup to exit, active threads is 0
    [junit] 2011-02-14 12:23:40,460 INFO  datanode.FSDatasetAsyncDiskService (FSDatasetAsyncDiskService.java:shutdown(133))
- Shutting down all async disk service threads...
    [junit] 2011-02-14 12:23:40,460 INFO  datanode.FSDatasetAsyncDiskService (FSDatasetAsyncDiskService.java:shutdown(142))
- All async disk service threads have been shut down.
    [junit] 2011-02-14 12:23:40,460 WARN  datanode.FSDatasetAsyncDiskService (FSDatasetAsyncDiskService.java:shutdown(130))
- AsyncDiskService has already shut down.
    [junit] 2011-02-14 12:23:40,462 WARN  namenode.FSNamesystem (FSNamesystem.java:run(2847))
- ReplicationMonitor thread received InterruptedException.java.lang.InterruptedException:
sleep interrupted
    [junit] 2011-02-14 12:23:40,462 INFO  namenode.FSEditLog (FSEditLog.java:printStatistics(559))
- Number of transactions: 6 Total time for transactions(ms): 2Number of transactions batched
in Syncs: 0 Number of syncs: 3 SyncTimes(ms): 7 3 
    [junit] 2011-02-14 12:23:40,463 WARN  namenode.DecommissionManager (DecommissionManager.java:run(70))
- Monitor interrupted: java.lang.InterruptedException: sleep interrupted
    [junit] 2011-02-14 12:23:40,464 INFO  ipc.Server (Server.java:stop(1610)) - Stopping server
on 42776
    [junit] 2011-02-14 12:23:40,464 INFO  ipc.Server (Server.java:run(1443)) - IPC Server
handler 0 on 42776: exiting
    [junit] 2011-02-14 12:23:40,464 INFO  ipc.Server (Server.java:run(1443)) - IPC Server
handler 3 on 42776: exiting
    [junit] 2011-02-14 12:23:40,464 INFO  ipc.Server (Server.java:run(1443)) - IPC Server
handler 1 on 42776: exiting
    [junit] 2011-02-14 12:23:40,464 INFO  ipc.Server (Server.java:run(1443)) - IPC Server
handler 2 on 42776: exiting
    [junit] 2011-02-14 12:23:40,465 INFO  ipc.Server (Server.java:run(1443)) - IPC Server
handler 7 on 42776: exiting
    [junit] 2011-02-14 12:23:40,465 INFO  ipc.Server (Server.java:run(1443)) - IPC Server
handler 5 on 42776: exiting
    [junit] 2011-02-14 12:23:40,465 INFO  ipc.Server (Server.java:run(675)) - Stopping IPC
Server Responder
    [junit] 2011-02-14 12:23:40,465 INFO  ipc.Server (Server.java:run(475)) - Stopping IPC
Server listener on 42776
    [junit] 2011-02-14 12:23:40,465 INFO  ipc.Server (Server.java:run(1443)) - IPC Server
handler 9 on 42776: exiting
    [junit] 2011-02-14 12:23:40,465 INFO  ipc.Server (Server.java:run(1443)) - IPC Server
handler 8 on 42776: exiting
    [junit] 2011-02-14 12:23:40,464 INFO  ipc.Server (Server.java:run(1443)) - IPC Server
handler 6 on 42776: exiting
    [junit] 2011-02-14 12:23:40,464 INFO  ipc.Server (Server.java:run(1443)) - IPC Server
handler 4 on 42776: exiting
    [junit] Tests run: 3, Failures: 0, Errors: 0, Time elapsed: 34.983 sec

checkfailure:

-run-test-hdfs-fault-inject-withtestcaseonly:

run-test-hdfs-fault-inject:

BUILD FAILED
/grid/0/hudson/hudson-slave/workspace/Hadoop-Hdfs-trunk/trunk/build.xml:746: Tests failed!

Total time: 50 minutes 37 seconds
[FINDBUGS] Skipping publisher since build result is FAILURE
Publishing Javadoc
Archiving artifacts
Recording test results
Recording fingerprints
Publishing Clover coverage report...
No Clover report will be published due to a Build Failure
Email was triggered for: Failure
Sending email for trigger: Failure



###################################################################################
############################## FAILED TESTS (if any) ##############################
1 tests failed.
REGRESSION:  org.apache.hadoop.hdfs.server.datanode.TestBlockReport.blockReport_08

Error Message:
Wrong number of PendingReplication blocks expected:<2> but was:<1>

Stack Trace:
junit.framework.AssertionFailedError: Wrong number of PendingReplication blocks expected:<2>
but was:<1>
	at org.apache.hadoop.hdfs.server.datanode.TestBlockReport.__CLR3_0_2j2e00jr97(TestBlockReport.java:414)
	at org.apache.hadoop.hdfs.server.datanode.TestBlockReport.blockReport_08(TestBlockReport.java:390)




Mime
View raw message