hadoop-hdfs-dev mailing list archives

Site index · List index
Message view « Date » · « Thread »
Top « Date » · « Thread »
From Apache Hudson Server <hud...@hudson.apache.org>
Subject Hadoop-Hdfs-trunk-Commit - Build # 534 - Still Failing
Date Tue, 08 Feb 2011 07:22:09 GMT
See https://hudson.apache.org/hudson/job/Hadoop-Hdfs-trunk-Commit/534/

###################################################################################
########################## LAST 60 LINES OF THE CONSOLE ###########################
[...truncated 77139 lines...]
    [junit] 2011-02-08 07:15:09,515 WARN  datanode.FSDatasetAsyncDiskService (FSDatasetAsyncDiskService.java:shutdown(130))
- AsyncDiskService has already shut down.
    [junit] 2011-02-08 07:15:09,515 INFO  hdfs.MiniDFSCluster (MiniDFSCluster.java:shutdownDataNodes(835))
- Shutting down DataNode 0
    [junit] 2011-02-08 07:15:09,618 INFO  ipc.Server (Server.java:stop(1610)) - Stopping server
on 40738
    [junit] 2011-02-08 07:15:09,618 INFO  ipc.Server (Server.java:run(1443)) - IPC Server
handler 0 on 40738: exiting
    [junit] 2011-02-08 07:15:09,619 INFO  ipc.Server (Server.java:run(675)) - Stopping IPC
Server Responder
    [junit] 2011-02-08 07:15:09,619 WARN  datanode.DataNode (DataXceiverServer.java:run(141))
- DatanodeRegistration(127.0.0.1:49466, storageID=DS-497836638-127.0.1.1-49466-1297149140242,
infoPort=34421, ipcPort=40738):DataXceiveServer: java.nio.channels.AsynchronousCloseException
    [junit] 	at java.nio.channels.spi.AbstractInterruptibleChannel.end(AbstractInterruptibleChannel.java:185)
    [junit] 	at sun.nio.ch.ServerSocketChannelImpl.accept(ServerSocketChannelImpl.java:152)
    [junit] 	at sun.nio.ch.ServerSocketAdaptor.accept(ServerSocketAdaptor.java:84)
    [junit] 	at org.apache.hadoop.hdfs.server.datanode.DataXceiverServer.run(DataXceiverServer.java:134)
    [junit] 	at java.lang.Thread.run(Thread.java:619)
    [junit] 
    [junit] 2011-02-08 07:15:09,618 INFO  ipc.Server (Server.java:run(1443)) - IPC Server
handler 1 on 40738: exiting
    [junit] 2011-02-08 07:15:09,618 INFO  ipc.Server (Server.java:run(475)) - Stopping IPC
Server listener on 40738
    [junit] 2011-02-08 07:15:09,619 INFO  datanode.DataNode (DataNode.java:shutdown(786))
- Waiting for threadgroup to exit, active threads is 0
    [junit] 2011-02-08 07:15:09,620 INFO  ipc.Server (Server.java:run(1443)) - IPC Server
handler 2 on 40738: exiting
    [junit] 2011-02-08 07:15:09,620 INFO  datanode.DataBlockScanner (DataBlockScanner.java:run(622))
- Exiting DataBlockScanner thread.
    [junit] 2011-02-08 07:15:09,621 INFO  datanode.DataNode (DataNode.java:run(1460)) - DatanodeRegistration(127.0.0.1:49466,
storageID=DS-497836638-127.0.1.1-49466-1297149140242, infoPort=34421, ipcPort=40738):Finishing
DataNode in: FSDataset{dirpath='/grid/0/hudson/hudson-slave/workspace/Hadoop-Hdfs-trunk-Commit/trunk/build/test/data/dfs/data/data1/current/finalized,/grid/0/hudson/hudson-slave/workspace/Hadoop-Hdfs-trunk-Commit/trunk/build/test/data/dfs/data/data2/current/finalized'}
    [junit] 2011-02-08 07:15:09,621 INFO  ipc.Server (Server.java:stop(1610)) - Stopping server
on 40738
    [junit] 2011-02-08 07:15:09,621 INFO  datanode.DataNode (DataNode.java:shutdown(786))
- Waiting for threadgroup to exit, active threads is 0
    [junit] 2011-02-08 07:15:09,621 INFO  datanode.FSDatasetAsyncDiskService (FSDatasetAsyncDiskService.java:shutdown(133))
- Shutting down all async disk service threads...
    [junit] 2011-02-08 07:15:09,622 INFO  datanode.FSDatasetAsyncDiskService (FSDatasetAsyncDiskService.java:shutdown(142))
- All async disk service threads have been shut down.
    [junit] 2011-02-08 07:15:09,622 WARN  datanode.FSDatasetAsyncDiskService (FSDatasetAsyncDiskService.java:shutdown(130))
- AsyncDiskService has already shut down.
    [junit] 2011-02-08 07:15:09,724 WARN  namenode.FSNamesystem (FSNamesystem.java:run(2847))
- ReplicationMonitor thread received InterruptedException.java.lang.InterruptedException:
sleep interrupted
    [junit] 2011-02-08 07:15:09,725 WARN  namenode.DecommissionManager (DecommissionManager.java:run(70))
- Monitor interrupted: java.lang.InterruptedException: sleep interrupted
    [junit] 2011-02-08 07:15:09,725 INFO  namenode.FSEditLog (FSEditLog.java:printStatistics(559))
- Number of transactions: 12 Total time for transactions(ms): 0Number of transactions batched
in Syncs: 1 Number of syncs: 9 SyncTimes(ms): 10 6 
    [junit] 2011-02-08 07:15:09,726 INFO  ipc.Server (Server.java:stop(1610)) - Stopping server
on 35252
    [junit] 2011-02-08 07:15:09,727 INFO  ipc.Server (Server.java:run(1443)) - IPC Server
handler 1 on 35252: exiting
    [junit] 2011-02-08 07:15:09,727 INFO  ipc.Server (Server.java:run(1443)) - IPC Server
handler 3 on 35252: exiting
    [junit] 2011-02-08 07:15:09,729 INFO  ipc.Server (Server.java:run(1443)) - IPC Server
handler 8 on 35252: exiting
    [junit] 2011-02-08 07:15:09,729 INFO  ipc.Server (Server.java:run(1443)) - IPC Server
handler 6 on 35252: exiting
    [junit] 2011-02-08 07:15:09,727 INFO  ipc.Server (Server.java:run(1443)) - IPC Server
handler 5 on 35252: exiting
    [junit] 2011-02-08 07:15:09,727 INFO  ipc.Server (Server.java:run(1443)) - IPC Server
handler 9 on 35252: exiting
    [junit] 2011-02-08 07:15:09,727 INFO  ipc.Server (Server.java:run(1443)) - IPC Server
handler 4 on 35252: exiting
    [junit] 2011-02-08 07:15:09,727 INFO  ipc.Server (Server.java:run(1443)) - IPC Server
handler 0 on 35252: exiting
    [junit] 2011-02-08 07:15:09,730 INFO  ipc.Server (Server.java:run(675)) - Stopping IPC
Server Responder
    [junit] 2011-02-08 07:15:09,730 INFO  ipc.Server (Server.java:run(1443)) - IPC Server
handler 2 on 35252: exiting
    [junit] 2011-02-08 07:15:09,729 INFO  ipc.Server (Server.java:run(1443)) - IPC Server
handler 7 on 35252: exiting
    [junit] 2011-02-08 07:15:09,729 INFO  ipc.Server (Server.java:run(475)) - Stopping IPC
Server listener on 35252
    [junit] Tests run: 3, Failures: 0, Errors: 0, Time elapsed: 573.306 sec

checkfailure:
    [touch] Creating /grid/0/hudson/hudson-slave/workspace/Hadoop-Hdfs-trunk-Commit/trunk/build/test/testsfailed

BUILD FAILED
/grid/0/hudson/hudson-slave/workspace/Hadoop-Hdfs-trunk-Commit/trunk/build.xml:702: The following
error occurred while executing this line:
/grid/0/hudson/hudson-slave/workspace/Hadoop-Hdfs-trunk-Commit/trunk/build.xml:659: The following
error occurred while executing this line:
/grid/0/hudson/hudson-slave/workspace/Hadoop-Hdfs-trunk-Commit/trunk/build.xml:727: Tests
failed!

Total time: 344 minutes 52 seconds
[FINDBUGS] Skipping publisher since build result is FAILURE
Recording fingerprints
Archiving artifacts
Recording test results
Publishing Javadoc
Publishing Clover coverage report...
No Clover report will be published due to a Build Failure
Email was triggered for: Failure
Sending email for trigger: Failure



###################################################################################
############################## FAILED TESTS (if any) ##############################
12 tests failed.
FAILED:  org.apache.hadoop.hdfs.TestDFSShell.testErrOutPut

Error Message:
Timeout occurred. Please note the time in the report does not reflect the time until the timeout.

Stack Trace:
junit.framework.AssertionFailedError: Timeout occurred. Please note the time in the report
does not reflect the time until the timeout.


FAILED:  org.apache.hadoop.hdfs.TestDFSUpgradeFromImage.testUpgradeFromImage

Error Message:
Timeout occurred. Please note the time in the report does not reflect the time until the timeout.

Stack Trace:
junit.framework.AssertionFailedError: Timeout occurred. Please note the time in the report
does not reflect the time until the timeout.


FAILED:  org.apache.hadoop.hdfs.TestDistributedFileSystem.testAllWithDualPort

Error Message:
Timeout occurred. Please note the time in the report does not reflect the time until the timeout.

Stack Trace:
junit.framework.AssertionFailedError: Timeout occurred. Please note the time in the report
does not reflect the time until the timeout.


FAILED:  org.apache.hadoop.hdfs.TestFileAppend.testComplexFlush

Error Message:
Timeout occurred. Please note the time in the report does not reflect the time until the timeout.

Stack Trace:
junit.framework.AssertionFailedError: Timeout occurred. Please note the time in the report
does not reflect the time until the timeout.


FAILED:  org.apache.hadoop.hdfs.TestFileAppend2.testComplexAppend

Error Message:
Timeout occurred. Please note the time in the report does not reflect the time until the timeout.

Stack Trace:
junit.framework.AssertionFailedError: Timeout occurred. Please note the time in the report
does not reflect the time until the timeout.


FAILED:  org.apache.hadoop.hdfs.TestFileAppend3.testAppendToPartialChunk

Error Message:
Timeout occurred. Please note the time in the report does not reflect the time until the timeout.

Stack Trace:
junit.framework.AssertionFailedError: Timeout occurred. Please note the time in the report
does not reflect the time until the timeout.


FAILED:  org.apache.hadoop.hdfs.TestHDFSTrash.testTrashEmptier

Error Message:
null

Stack Trace:
junit.framework.AssertionFailedError: null
	at org.apache.hadoop.fs.TestTrash.testTrashEmptier(TestTrash.java:460)
	at junit.extensions.TestDecorator.basicRun(TestDecorator.java:24)
	at junit.extensions.TestSetup$1.protect(TestSetup.java:23)
	at junit.extensions.TestSetup.run(TestSetup.java:27)


FAILED:  org.apache.hadoop.hdfs.TestPread.testPreadDFSSimulated

Error Message:
Timeout occurred. Please note the time in the report does not reflect the time until the timeout.

Stack Trace:
junit.framework.AssertionFailedError: Timeout occurred. Please note the time in the report
does not reflect the time until the timeout.


FAILED:  org.apache.hadoop.hdfs.TestQuota.testMultipleFilesSmallerThanOneBlock

Error Message:
Timeout occurred. Please note the time in the report does not reflect the time until the timeout.

Stack Trace:
junit.framework.AssertionFailedError: Timeout occurred. Please note the time in the report
does not reflect the time until the timeout.


FAILED:  org.apache.hadoop.hdfs.TestRestartDFS.testRestartDualPortDFS

Error Message:
Timeout occurred. Please note the time in the report does not reflect the time until the timeout.

Stack Trace:
junit.framework.AssertionFailedError: Timeout occurred. Please note the time in the report
does not reflect the time until the timeout.


FAILED:  org.apache.hadoop.hdfs.server.namenode.TestBackupNode.testCheckpoint

Error Message:
Timeout occurred. Please note the time in the report does not reflect the time until the timeout.

Stack Trace:
junit.framework.AssertionFailedError: Timeout occurred. Please note the time in the report
does not reflect the time until the timeout.


FAILED:  org.apache.hadoop.hdfs.server.namenode.TestCheckpoint.testCheckpoint

Error Message:
Timeout occurred. Please note the time in the report does not reflect the time until the timeout.

Stack Trace:
junit.framework.AssertionFailedError: Timeout occurred. Please note the time in the report
does not reflect the time until the timeout.




Mime
View raw message