hadoop-hdfs-dev mailing list archives

Site index · List index
Message view « Date » · « Thread »
Top « Date » · « Thread »
From Apache Hudson Server <hud...@hudson.apache.org>
Subject Hadoop-Hdfs-22-branch - Build # 22 - Still Failing
Date Thu, 10 Feb 2011 23:02:04 GMT
See https://hudson.apache.org/hudson/job/Hadoop-Hdfs-22-branch/22/

###################################################################################
########################## LAST 60 LINES OF THE CONSOLE ###########################
[...truncated 2906 lines...]
    [junit] Running org.apache.hadoop.hdfs.TestDFSClientRetries
    [junit] Tests run: 5, Failures: 0, Errors: 0, Time elapsed: 43.019 sec
    [junit] Running org.apache.hadoop.hdfs.TestDFSPermission
    [junit] Tests run: 3, Failures: 0, Errors: 0, Time elapsed: 17.339 sec
    [junit] Running org.apache.hadoop.hdfs.TestDFSRemove
    [junit] Tests run: 1, Failures: 0, Errors: 0, Time elapsed: 14.454 sec
    [junit] Running org.apache.hadoop.hdfs.TestDFSStartupVersions
    [junit] Tests run: 1, Failures: 0, Errors: 0, Time elapsed: 19.253 sec
    [junit] Running org.apache.hadoop.hdfs.TestDFSUpgrade
    [junit] Tests run: 1, Failures: 0, Errors: 0, Time elapsed: 27.149 sec
    [junit] Running org.apache.hadoop.hdfs.TestDFSUtil
    [junit] Tests run: 1, Failures: 0, Errors: 0, Time elapsed: 0.17 sec
    [junit] Running org.apache.hadoop.hdfs.TestDatanodeBlockScanner
    [junit] Tests run: 4, Failures: 0, Errors: 0, Time elapsed: 97.15 sec
    [junit] Running org.apache.hadoop.hdfs.TestDatanodeConfig
    [junit] Tests run: 1, Failures: 0, Errors: 0, Time elapsed: 2.451 sec
    [junit] Running org.apache.hadoop.hdfs.TestDatanodeDeath
    [junit] Tests run: 4, Failures: 0, Errors: 0, Time elapsed: 129.106 sec
    [junit] Running org.apache.hadoop.hdfs.TestDatanodeRegistration
    [junit] Tests run: 1, Failures: 0, Errors: 0, Time elapsed: 3.808 sec
    [junit] Running org.apache.hadoop.hdfs.TestDecommission
    [junit] Tests run: 1, Failures: 0, Errors: 0, Time elapsed: 32.382 sec
    [junit] Running org.apache.hadoop.hdfs.TestDeprecatedKeys
    [junit] Tests run: 1, Failures: 0, Errors: 0, Time elapsed: 0.257 sec
    [junit] Running org.apache.hadoop.hdfs.TestDfsOverAvroRpc
    [junit] Tests run: 1, Failures: 0, Errors: 0, Time elapsed: 3.394 sec
    [junit] Running org.apache.hadoop.hdfs.TestFileAppend4
    [junit] Tests run: 2, Failures: 0, Errors: 0, Time elapsed: 9.728 sec
    [junit] Running org.apache.hadoop.hdfs.TestFileConcurrentReader
    [junit] Tests run: 7, Failures: 0, Errors: 0, Time elapsed: 31.532 sec
    [junit] Running org.apache.hadoop.hdfs.TestFileCreation
    [junit] Tests run: 12, Failures: 0, Errors: 0, Time elapsed: 47.992 sec
    [junit] Running org.apache.hadoop.hdfs.TestFileCreationClient
    [junit] Tests run: 1, Failures: 0, Errors: 0, Time elapsed: 9.609 sec
    [junit] Running org.apache.hadoop.hdfs.TestFileCreationDelete
    [junit] Tests run: 1, Failures: 0, Errors: 0, Time elapsed: 12.825 sec
    [junit] Running org.apache.hadoop.hdfs.TestFileCreationEmpty
    [junit] Tests run: 1, Failures: 0, Errors: 0, Time elapsed: 8.136 sec
    [junit] Running org.apache.hadoop.hdfs.TestHDFSFileSystemContract
    [junit] Tests run: 28, Failures: 0, Errors: 0, Time elapsed: 35.695 sec
    [junit] Running org.apache.hadoop.hdfs.TestHFlush
    [junit] Tests run: 5, Failures: 0, Errors: 0, Time elapsed: 19.144 sec
    [junit] Running org.apache.hadoop.hdfs.TestHftpFileSystem
    [junit] Tests run: 3, Failures: 0, Errors: 0, Time elapsed: 2.738 sec
    [junit] Running org.apache.hadoop.hdfs.TestInjectionForSimulatedStorage
    [junit] Tests run: 1, Failures: 0, Errors: 0, Time elapsed: 14.365 sec
    [junit] Running org.apache.hadoop.hdfs.TestLargeBlock
    [junit] Tests run: 1, Failures: 0, Errors: 0, Time elapsed: 44.525 sec
    [junit] Running org.apache.hadoop.hdfs.TestLeaseRecovery2
Build timed out. Aborting
[FINDBUGS] Skipping publisher since build result is FAILURE
Publishing Javadoc
Archiving artifacts
Recording test results
Recording fingerprints
Publishing Clover coverage report...
No Clover report will be published due to a Build Failure
Email was triggered for: Failure
Sending email for trigger: Failure



###################################################################################
############################## FAILED TESTS (if any) ##############################
1 tests failed.
FAILED:  TEST-org.apache.hadoop.hdfs.TestLeaseRecovery2.xml.<init>

Error Message:


Stack Trace:
Test report file /grid/0/hudson/hudson-slave/workspace/Hadoop-Hdfs-22-branch/trunk/build/test/TEST-org.apache.hadoop.hdfs.TestLeaseRecovery2.xml
was length 0



Mime
View raw message