hadoop-hdfs-dev mailing list archives

Site index · List index
Message view « Date » · « Thread »
Top « Date » · « Thread »
From Apache Hudson Server <hud...@hudson.apache.org>
Subject Hadoop-Hdfs-22-branch - Build # 9 - Still Failing
Date Tue, 04 Jan 2011 15:32:00 GMT
See https://hudson.apache.org/hudson/job/Hadoop-Hdfs-22-branch/9/

###################################################################################
########################## LAST 60 LINES OF THE CONSOLE ###########################
[...truncated 2892 lines...]
    [junit] Running org.apache.hadoop.fs.loadGenerator.TestLoadGenerator
    [junit] Tests run: 2, Failures: 0, Errors: 0, Time elapsed: 13.04 sec
    [junit] Running org.apache.hadoop.fs.permission.TestStickyBit
    [junit] Tests run: 3, Failures: 0, Errors: 0, Time elapsed: 9.391 sec
    [junit] Running org.apache.hadoop.hdfs.TestBlockMissingException
    [junit] Tests run: 1, Failures: 0, Errors: 0, Time elapsed: 17.863 sec
    [junit] Running org.apache.hadoop.hdfs.TestByteRangeInputStream
    [junit] Tests run: 1, Failures: 0, Errors: 0, Time elapsed: 0.147 sec
    [junit] Running org.apache.hadoop.hdfs.TestClientBlockVerification
    [junit] Tests run: 4, Failures: 0, Errors: 0, Time elapsed: 3.016 sec
    [junit] Running org.apache.hadoop.hdfs.TestClientProtocolForPipelineRecovery
    [junit] Tests run: 1, Failures: 0, Errors: 0, Time elapsed: 2.511 sec
    [junit] Running org.apache.hadoop.hdfs.TestCrcCorruption
    [junit] Tests run: 3, Failures: 0, Errors: 0, Time elapsed: 22.084 sec
    [junit] Running org.apache.hadoop.hdfs.TestDFSClientExcludedNodes
    [junit] Tests run: 1, Failures: 0, Errors: 0, Time elapsed: 2.948 sec
    [junit] Running org.apache.hadoop.hdfs.TestDFSClientRetries
    [junit] Tests run: 5, Failures: 0, Errors: 0, Time elapsed: 47.011 sec
    [junit] Running org.apache.hadoop.hdfs.TestDFSPermission
    [junit] Tests run: 3, Failures: 0, Errors: 0, Time elapsed: 16.901 sec
    [junit] Running org.apache.hadoop.hdfs.TestDFSRemove
    [junit] Tests run: 1, Failures: 0, Errors: 0, Time elapsed: 14.926 sec
    [junit] Running org.apache.hadoop.hdfs.TestDFSStartupVersions
    [junit] Tests run: 1, Failures: 0, Errors: 0, Time elapsed: 17.986 sec
    [junit] Running org.apache.hadoop.hdfs.TestDFSUpgrade
    [junit] Tests run: 1, Failures: 0, Errors: 0, Time elapsed: 26.901 sec
    [junit] Running org.apache.hadoop.hdfs.TestDFSUtil
    [junit] Tests run: 1, Failures: 0, Errors: 0, Time elapsed: 0.155 sec
    [junit] Running org.apache.hadoop.hdfs.TestDatanodeBlockScanner
    [junit] Tests run: 4, Failures: 0, Errors: 0, Time elapsed: 247.522 sec
    [junit] Running org.apache.hadoop.hdfs.TestDatanodeConfig
    [junit] Tests run: 1, Failures: 0, Errors: 0, Time elapsed: 2.57 sec
    [junit] Running org.apache.hadoop.hdfs.TestDatanodeDeath
    [junit] Tests run: 4, Failures: 0, Errors: 0, Time elapsed: 116.198 sec
    [junit] Running org.apache.hadoop.hdfs.TestDatanodeRegistration
    [junit] Tests run: 1, Failures: 0, Errors: 0, Time elapsed: 3.925 sec
    [junit] Running org.apache.hadoop.hdfs.TestDecommission
    [junit] Tests run: 1, Failures: 0, Errors: 0, Time elapsed: 26.247 sec
    [junit] Running org.apache.hadoop.hdfs.TestDeprecatedKeys
    [junit] Tests run: 1, Failures: 0, Errors: 0, Time elapsed: 0.269 sec
    [junit] Running org.apache.hadoop.hdfs.TestDfsOverAvroRpc
    [junit] Tests run: 1, Failures: 0, Errors: 0, Time elapsed: 4.122 sec
    [junit] Running org.apache.hadoop.hdfs.TestFileAppend4
    [junit] Tests run: 2, Failures: 0, Errors: 0, Time elapsed: 9.561 sec
    [junit] Running org.apache.hadoop.hdfs.TestFileConcurrentReader
    [junit] Tests run: 7, Failures: 0, Errors: 0, Time elapsed: 24.566 sec
    [junit] Running org.apache.hadoop.hdfs.TestFileCreation
    [junit] Tests run: 12, Failures: 0, Errors: 0, Time elapsed: 47.717 sec
    [junit] Running org.apache.hadoop.hdfs.TestFileCreationClient
Build timed out. Aborting
[FINDBUGS] Skipping publisher since build result is FAILURE
Publishing Javadoc
Archiving artifacts
Recording test results
Recording fingerprints
Publishing Clover coverage report...
No Clover report will be published due to a Build Failure
Email was triggered for: Failure
Sending email for trigger: Failure



###################################################################################
############################## FAILED TESTS (if any) ##############################
2 tests failed.
FAILED:  TEST-org.apache.hadoop.hdfs.TestFileCreationClient.xml.<init>

Error Message:


Stack Trace:
Test report file /grid/0/hudson/hudson-slave/workspace/Hadoop-Hdfs-22-branch/trunk/build/test/TEST-org.apache.hadoop.hdfs.TestFileCreationClient.xml
was length 0

FAILED:  org.apache.hadoop.hdfs.server.namenode.TestStorageRestore.testStorageRestore

Error Message:
Image file /grid/0/hudson/hudson-slave/workspace/Hadoop-Hdfs-22-branch/trunk/build/test/data/dfs/secondary/current/fsimage
is corrupt with MD5 checksum of 69cb34dc2f4703f330573600392b95b0 but expecting fcc421ec3420dba57135ac329e68cb61

Stack Trace:
java.io.IOException: Image file /grid/0/hudson/hudson-slave/workspace/Hadoop-Hdfs-22-branch/trunk/build/test/data/dfs/secondary/current/fsimage
is corrupt with MD5 checksum of 69cb34dc2f4703f330573600392b95b0 but expecting fcc421ec3420dba57135ac329e68cb61
	at org.apache.hadoop.hdfs.server.namenode.FSImage.loadFSImage(FSImage.java:1062)
	at org.apache.hadoop.hdfs.server.namenode.SecondaryNameNode$CheckpointStorage.doMerge(SecondaryNameNode.java:678)
	at org.apache.hadoop.hdfs.server.namenode.SecondaryNameNode$CheckpointStorage.access$500(SecondaryNameNode.java:583)
	at org.apache.hadoop.hdfs.server.namenode.SecondaryNameNode.doMerge(SecondaryNameNode.java:460)
	at org.apache.hadoop.hdfs.server.namenode.SecondaryNameNode.doCheckpoint(SecondaryNameNode.java:424)
	at org.apache.hadoop.hdfs.server.namenode.TestStorageRestore.__CLR3_0_2dn2tm410tr(TestStorageRestore.java:316)
	at org.apache.hadoop.hdfs.server.namenode.TestStorageRestore.testStorageRestore(TestStorageRestore.java:286)




Mime
View raw message