hadoop-hdfs-dev mailing list archives

Site index · List index
Message view « Date » · « Thread »
Top « Date » · « Thread »
From Apache Hudson Server <hud...@hudson.apache.org>
Subject Hadoop-Hdfs-22-branch - Build # 12 - Still Failing
Date Fri, 07 Jan 2011 15:31:35 GMT
See https://hudson.apache.org/hudson/job/Hadoop-Hdfs-22-branch/12/

###################################################################################
########################## LAST 60 LINES OF THE CONSOLE ###########################
[...truncated 3040 lines...]
    [junit] Running org.apache.hadoop.hdfs.server.common.TestDistributedUpgrade
    [junit] Tests run: 1, Failures: 0, Errors: 0, Time elapsed: 31.336 sec
    [junit] Running org.apache.hadoop.hdfs.server.common.TestGetUriFromString
    [junit] Tests run: 3, Failures: 0, Errors: 0, Time elapsed: 0.139 sec
    [junit] Running org.apache.hadoop.hdfs.server.common.TestJspHelper
    [junit] Tests run: 2, Failures: 0, Errors: 0, Time elapsed: 0.831 sec
    [junit] Running org.apache.hadoop.hdfs.server.datanode.TestBlockReport
    [junit] Tests run: 7, Failures: 0, Errors: 0, Time elapsed: 50.797 sec
    [junit] Running org.apache.hadoop.hdfs.server.datanode.TestDataNodeMXBean
    [junit] Tests run: 1, Failures: 0, Errors: 0, Time elapsed: 2.39 sec
    [junit] Running org.apache.hadoop.hdfs.server.datanode.TestDataNodeMetrics
    [junit] Tests run: 1, Failures: 0, Errors: 0, Time elapsed: 28.76 sec
    [junit] Running org.apache.hadoop.hdfs.server.datanode.TestDataNodeVolumeFailure
    [junit] Tests run: 1, Failures: 0, Errors: 0, Time elapsed: 3.533 sec
    [junit] Running org.apache.hadoop.hdfs.server.datanode.TestDataNodeVolumeFailureReporting
    [junit] Tests run: 3, Failures: 0, Errors: 0, Time elapsed: 72.15 sec
    [junit] Running org.apache.hadoop.hdfs.server.datanode.TestDataXceiver
    [junit] Tests run: 1, Failures: 0, Errors: 0, Time elapsed: 2.614 sec
    [junit] Running org.apache.hadoop.hdfs.server.datanode.TestDatanodeRestart
    [junit] Tests run: 2, Failures: 0, Errors: 0, Time elapsed: 5.983 sec
    [junit] Running org.apache.hadoop.hdfs.server.datanode.TestReplicasMap
    [junit] Tests run: 3, Failures: 0, Errors: 0, Time elapsed: 0.085 sec
    [junit] Running org.apache.hadoop.hdfs.server.datanode.TestWriteToReplica
    [junit] Tests run: 4, Failures: 0, Errors: 0, Time elapsed: 5.12 sec
    [junit] Running org.apache.hadoop.hdfs.server.namenode.TestAllowFormat
    [junit] Tests run: 1, Failures: 0, Errors: 0, Time elapsed: 2.258 sec
    [junit] Running org.apache.hadoop.hdfs.server.namenode.TestBlockTokenWithDFS
    [junit] Tests run: 4, Failures: 0, Errors: 0, Time elapsed: 30.934 sec
    [junit] Running org.apache.hadoop.hdfs.server.namenode.TestBlockUnderConstruction
    [junit] Tests run: 2, Failures: 0, Errors: 0, Time elapsed: 3.354 sec
    [junit] Running org.apache.hadoop.hdfs.server.namenode.TestBlocksWithNotEnoughRacks
    [junit] Tests run: 2, Failures: 0, Errors: 0, Time elapsed: 9.019 sec
    [junit] Running org.apache.hadoop.hdfs.server.namenode.TestCheckPointForSecurityTokens
    [junit] Tests run: 1, Failures: 0, Errors: 0, Time elapsed: 7.492 sec
    [junit] Running org.apache.hadoop.hdfs.server.namenode.TestCorruptFilesJsp
    [junit] Tests run: 1, Failures: 0, Errors: 0, Time elapsed: 8.716 sec
    [junit] Running org.apache.hadoop.hdfs.server.namenode.TestCorruptReplicaInfo
    [junit] Tests run: 1, Failures: 0, Errors: 0, Time elapsed: 0.228 sec
    [junit] Running org.apache.hadoop.hdfs.server.namenode.TestDeadDatanode
    [junit] Tests run: 1, Failures: 0, Errors: 0, Time elapsed: 16.355 sec
    [junit] Running org.apache.hadoop.hdfs.server.namenode.TestDecommissioningStatus
    [junit] Tests run: 1, Failures: 0, Errors: 0, Time elapsed: 17.891 sec
    [junit] Running org.apache.hadoop.hdfs.server.namenode.TestEditLogRace
    [junit] Tests run: 4, Failures: 0, Errors: 0, Time elapsed: 30.099 sec
    [junit] Running org.apache.hadoop.hdfs.server.namenode.TestFsck
    [junit] Tests run: 8, Failures: 0, Errors: 0, Time elapsed: 53.438 sec
    [junit] Running org.apache.hadoop.hdfs.server.namenode.TestHDFSConcat
    [junit] Tests run: 3, Failures: 0, Errors: 0, Time elapsed: 6.322 sec
    [junit] Running org.apache.hadoop.hdfs.server.namenode.TestLargeDirectoryDelete
Build timed out. Aborting
[FINDBUGS] Skipping publisher since build result is FAILURE
Publishing Javadoc
Archiving artifacts
Recording test results
Recording fingerprints
Publishing Clover coverage report...
No Clover report will be published due to a Build Failure
Email was triggered for: Failure
Sending email for trigger: Failure



###################################################################################
############################## FAILED TESTS (if any) ##############################
2 tests failed.
FAILED:  TEST-org.apache.hadoop.hdfs.server.namenode.TestLargeDirectoryDelete.xml.<init>

Error Message:


Stack Trace:
Test report file /grid/0/hudson/hudson-slave/workspace/Hadoop-Hdfs-22-branch/trunk/build/test/TEST-org.apache.hadoop.hdfs.server.namenode.TestLargeDirectoryDelete.xml
was length 0

FAILED:  org.apache.hadoop.hdfs.server.namenode.TestStorageRestore.testStorageRestore

Error Message:
Image file /grid/0/hudson/hudson-slave/workspace/Hadoop-Hdfs-22-branch/trunk/build/test/data/dfs/secondary/current/fsimage
is corrupt with MD5 checksum of 898dfad64832a6759c34cf099d52efae but expecting 9b985408481219df62f6d22a9b0fbfd5

Stack Trace:
java.io.IOException: Image file /grid/0/hudson/hudson-slave/workspace/Hadoop-Hdfs-22-branch/trunk/build/test/data/dfs/secondary/current/fsimage
is corrupt with MD5 checksum of 898dfad64832a6759c34cf099d52efae but expecting 9b985408481219df62f6d22a9b0fbfd5
	at org.apache.hadoop.hdfs.server.namenode.FSImage.loadFSImage(FSImage.java:1062)
	at org.apache.hadoop.hdfs.server.namenode.SecondaryNameNode$CheckpointStorage.doMerge(SecondaryNameNode.java:678)
	at org.apache.hadoop.hdfs.server.namenode.SecondaryNameNode$CheckpointStorage.access$500(SecondaryNameNode.java:583)
	at org.apache.hadoop.hdfs.server.namenode.SecondaryNameNode.doMerge(SecondaryNameNode.java:460)
	at org.apache.hadoop.hdfs.server.namenode.SecondaryNameNode.doCheckpoint(SecondaryNameNode.java:424)
	at org.apache.hadoop.hdfs.server.namenode.TestStorageRestore.__CLR3_0_2dn2tm410u7(TestStorageRestore.java:316)
	at org.apache.hadoop.hdfs.server.namenode.TestStorageRestore.testStorageRestore(TestStorageRestore.java:286)




Mime
View raw message