hadoop-hdfs-dev mailing list archives

Site index · List index
Message view « Date » · « Thread »
Top « Date » · « Thread »
From Apache Hudson Server <hud...@hudson.apache.org>
Subject Hadoop-Hdfs-22-branch - Build # 10 - Still Failing
Date Tue, 04 Jan 2011 22:30:51 GMT
See https://hudson.apache.org/hudson/job/Hadoop-Hdfs-22-branch/10/

###################################################################################
########################## LAST 60 LINES OF THE CONSOLE ###########################
[...truncated 1019 lines...]
ivy-init-antlib:

ivy-init:
[ivy:configure] :: Ivy 2.1.0 - 20090925235825 :: http://ant.apache.org/ivy/ ::
[ivy:configure] :: loading settings :: file = /grid/0/hudson/hudson-slave/workspace/Hadoop-Hdfs-22-branch/trunk/ivy/ivysettings.xml

ivy-resolve-common:
[ivy:resolve] 
[ivy:resolve] :: problems summary ::
[ivy:resolve] :::: WARNINGS
[ivy:resolve] 		module not found: org.apache.hadoop#hadoop-common;0.22.0-SNAPSHOT
[ivy:resolve] 	==== apache-snapshot: tried
[ivy:resolve] 	  https://repository.apache.org/content/repositories/snapshots/org/apache/hadoop/hadoop-common/0.22.0-SNAPSHOT/hadoop-common-0.22.0-SNAPSHOT.pom
[ivy:resolve] 	  -- artifact org.apache.hadoop#hadoop-common;0.22.0-SNAPSHOT!hadoop-common.jar:
[ivy:resolve] 	  https://repository.apache.org/content/repositories/snapshots/org/apache/hadoop/hadoop-common/0.22.0-SNAPSHOT/hadoop-common-0.22.0-SNAPSHOT.jar
[ivy:resolve] 	==== maven2: tried
[ivy:resolve] 	  http://repo1.maven.org/maven2/org/apache/hadoop/hadoop-common/0.22.0-SNAPSHOT/hadoop-common-0.22.0-SNAPSHOT.pom
[ivy:resolve] 	  -- artifact org.apache.hadoop#hadoop-common;0.22.0-SNAPSHOT!hadoop-common.jar:
[ivy:resolve] 	  http://repo1.maven.org/maven2/org/apache/hadoop/hadoop-common/0.22.0-SNAPSHOT/hadoop-common-0.22.0-SNAPSHOT.jar
[ivy:resolve] 		::::::::::::::::::::::::::::::::::::::::::::::
[ivy:resolve] 		::          UNRESOLVED DEPENDENCIES         ::
[ivy:resolve] 		::::::::::::::::::::::::::::::::::::::::::::::
[ivy:resolve] 		:: org.apache.hadoop#hadoop-common;0.22.0-SNAPSHOT: not found
[ivy:resolve] 		::::::::::::::::::::::::::::::::::::::::::::::
[ivy:resolve] :::: ERRORS
[ivy:resolve] 	SERVER ERROR: Bad Gateway url=https://repository.apache.org/content/repositories/snapshots/org/apache/hadoop/hadoop-common/0.22.0-SNAPSHOT/maven-metadata.xml
[ivy:resolve] 	SERVER ERROR: Bad Gateway url=https://repository.apache.org/content/repositories/snapshots/org/apache/hadoop/hadoop-common/0.22.0-SNAPSHOT/hadoop-common-0.22.0-SNAPSHOT.pom
[ivy:resolve] 	SERVER ERROR: Bad Gateway url=https://repository.apache.org/content/repositories/snapshots/org/apache/hadoop/hadoop-common/0.22.0-SNAPSHOT/hadoop-common-0.22.0-SNAPSHOT.jar
[ivy:resolve] 
[ivy:resolve] :: USE VERBOSE OR DEBUG MESSAGE LEVEL FOR MORE DETAILS

BUILD FAILED
/grid/0/hudson/hudson-slave/workspace/Hadoop-Hdfs-22-branch/trunk/build.xml:1750: impossible
to resolve dependencies:
	resolve failed - see output for details

Total time: 4 seconds


======================================================================
======================================================================
STORE: saving artifacts
======================================================================
======================================================================


mv: cannot stat `build/*.tar.gz': No such file or directory
mv: cannot stat `build/*.jar': No such file or directory
mv: cannot stat `build/test/findbugs': No such file or directory
mv: cannot stat `build/docs/api': No such file or directory
Build Failed
[FINDBUGS] Skipping publisher since build result is FAILURE
Publishing Javadoc
Archiving artifacts
Recording test results
Recording fingerprints
Publishing Clover coverage report...
No Clover report will be published due to a Build Failure
Email was triggered for: Failure
Sending email for trigger: Failure



###################################################################################
############################## FAILED TESTS (if any) ##############################
No tests ran.

Mime
View raw message