hadoop-hdfs-dev mailing list archives

Site index · List index
Message view « Date » · « Thread »
Top « Date » · « Thread »
From Apache Hudson Server <hud...@hudson.apache.org>
Subject Hadoop-Hdfs-22-branch - Build # 7 - Still Failing
Date Mon, 27 Dec 2010 23:49:36 GMT
See https://hudson.apache.org/hudson/job/Hadoop-Hdfs-22-branch/7/

###################################################################################
########################## LAST 60 LINES OF THE CONSOLE ###########################
[...truncated 3555 lines...]

compile-hdfs-test:
   [delete] Deleting directory /grid/0/hudson/hudson-slave/workspace/Hadoop-Hdfs-22-branch/trunk/build-fi/test/cache
    [mkdir] Created dir: /grid/0/hudson/hudson-slave/workspace/Hadoop-Hdfs-22-branch/trunk/build-fi/test/cache
     [copy] Copying 1 file to /grid/0/hudson/hudson-slave/workspace/Hadoop-Hdfs-22-branch/trunk/build-fi/test/cache
     [copy] Copying 1 file to /grid/0/hudson/hudson-slave/workspace/Hadoop-Hdfs-22-branch/trunk/build-fi/test/cache
     [copy] Copying 1 file to /grid/0/hudson/hudson-slave/workspace/Hadoop-Hdfs-22-branch/trunk/build-fi/test/cache
     [copy] Copying 1 file to /grid/0/hudson/hudson-slave/workspace/Hadoop-Hdfs-22-branch/trunk/build-fi/test/cache
     [copy] Copying 1 file to /grid/0/hudson/hudson-slave/workspace/Hadoop-Hdfs-22-branch/trunk/build-fi/test/cache
     [copy] Copying 1 file to /grid/0/hudson/hudson-slave/workspace/Hadoop-Hdfs-22-branch/trunk/build-fi/test/cache
     [copy] Copying 1 file to /grid/0/hudson/hudson-slave/workspace/Hadoop-Hdfs-22-branch/trunk/build-fi/test/cache
     [copy] Copying 1 file to /grid/0/hudson/hudson-slave/workspace/Hadoop-Hdfs-22-branch/trunk/build-fi/test/cache
     [copy] Copying 1 file to /grid/0/hudson/hudson-slave/workspace/Hadoop-Hdfs-22-branch/trunk/build-fi/test/cache
     [copy] Copying 1 file to /grid/0/hudson/hudson-slave/workspace/Hadoop-Hdfs-22-branch/trunk/build-fi/test/cache

run-test-hdfs-excluding-commit-and-smoke:
    [mkdir] Created dir: /grid/0/hudson/hudson-slave/workspace/Hadoop-Hdfs-22-branch/trunk/build-fi/test/data
    [mkdir] Created dir: /grid/0/hudson/hudson-slave/workspace/Hadoop-Hdfs-22-branch/trunk/build-fi/test/logs
     [copy] Copying 1 file to /grid/0/hudson/hudson-slave/workspace/Hadoop-Hdfs-22-branch/trunk/build-fi/test/extraconf
     [copy] Copying 1 file to /grid/0/hudson/hudson-slave/workspace/Hadoop-Hdfs-22-branch/trunk/build-fi/test/extraconf
    [junit] WARNING: multiple versions of ant detected in path for junit 
    [junit]          jar:file:/homes/hudson/tools/ant/latest/lib/ant.jar!/org/apache/tools/ant/Project.class
    [junit]      and jar:file:/homes/hudson/.ivy2/cache/ant/ant/jars/ant-1.6.5.jar!/org/apache/tools/ant/Project.class
    [junit] Running org.apache.hadoop.fs.TestFiListPath
    [junit] Tests run: 2, Failures: 0, Errors: 0, Time elapsed: 2.101 sec
    [junit] Running org.apache.hadoop.fs.TestFiRename
    [junit] Tests run: 4, Failures: 0, Errors: 0, Time elapsed: 6.323 sec
    [junit] Running org.apache.hadoop.hdfs.TestFiHFlush
    [junit] Tests run: 9, Failures: 0, Errors: 0, Time elapsed: 18.919 sec
    [junit] Running org.apache.hadoop.hdfs.TestFiHftp
    [junit] Tests run: 1, Failures: 0, Errors: 0, Time elapsed: 36.642 sec
    [junit] Running org.apache.hadoop.hdfs.TestFiPipelines
    [junit] Tests run: 3, Failures: 0, Errors: 0, Time elapsed: 5.652 sec
    [junit] Running org.apache.hadoop.hdfs.server.datanode.TestFiDataTransferProtocol
    [junit] Tests run: 29, Failures: 0, Errors: 0, Time elapsed: 222.045 sec
    [junit] Running org.apache.hadoop.hdfs.server.datanode.TestFiDataTransferProtocol2
    [junit] Tests run: 10, Failures: 0, Errors: 0, Time elapsed: 428.603 sec
    [junit] Running org.apache.hadoop.hdfs.server.datanode.TestFiPipelineClose
    [junit] Tests run: 3, Failures: 0, Errors: 0, Time elapsed: 36.3 sec

checkfailure:

-run-test-hdfs-fault-inject-withtestcaseonly:

run-test-hdfs-fault-inject:

BUILD FAILED
/grid/0/hudson/hudson-slave/workspace/Hadoop-Hdfs-22-branch/trunk/build.xml:736: Tests failed!

Total time: 68 minutes 29 seconds
[FINDBUGS] Skipping publisher since build result is FAILURE
Publishing Javadoc
Archiving artifacts
Recording test results
Recording fingerprints
Publishing Clover coverage report...
No Clover report will be published due to a Build Failure
Email was triggered for: Failure
Sending email for trigger: Failure



###################################################################################
############################## FAILED TESTS (if any) ##############################
3 tests failed.
REGRESSION:  org.apache.hadoop.hdfs.TestFileConcurrentReader.testUnfinishedBlockCRCErrorNormalTransfer

Error Message:
Too many open files

Stack Trace:
java.io.IOException: Too many open files
	at sun.nio.ch.EPollArrayWrapper.epollCreate(Native Method)
	at sun.nio.ch.EPollArrayWrapper.<init>(EPollArrayWrapper.java:68)
	at sun.nio.ch.EPollSelectorImpl.<init>(EPollSelectorImpl.java:52)
	at sun.nio.ch.EPollSelectorProvider.openSelector(EPollSelectorProvider.java:18)
	at java.nio.channels.Selector.open(Selector.java:209)
	at org.apache.hadoop.ipc.Server$Responder.<init>(Server.java:602)
	at org.apache.hadoop.ipc.Server.<init>(Server.java:1501)
	at org.apache.hadoop.ipc.RPC$Server.<init>(RPC.java:394)
	at org.apache.hadoop.ipc.WritableRpcEngine$Server.<init>(WritableRpcEngine.java:331)
	at org.apache.hadoop.ipc.WritableRpcEngine.getServer(WritableRpcEngine.java:291)
	at org.apache.hadoop.ipc.WritableRpcEngine.getServer(WritableRpcEngine.java:47)
	at org.apache.hadoop.ipc.RPC.getServer(RPC.java:382)
	at org.apache.hadoop.hdfs.server.datanode.DataNode.initIpcServer(DataNode.java:416)
	at org.apache.hadoop.hdfs.server.datanode.DataNode.startDataNode(DataNode.java:507)
	at org.apache.hadoop.hdfs.server.datanode.DataNode.<init>(DataNode.java:281)
	at org.apache.hadoop.hdfs.server.datanode.DataNode.<init>(DataNode.java:263)
	at org.apache.hadoop.hdfs.server.datanode.DataNode.makeInstance(DataNode.java:1561)
	at org.apache.hadoop.hdfs.server.datanode.DataNode.instantiateDataNode(DataNode.java:1504)
	at org.apache.hadoop.hdfs.server.datanode.DataNode.instantiateDataNode(DataNode.java:1471)
	at org.apache.hadoop.hdfs.MiniDFSCluster.startDataNodes(MiniDFSCluster.java:614)
	at org.apache.hadoop.hdfs.MiniDFSCluster.initMiniDFSCluster(MiniDFSCluster.java:448)
	at org.apache.hadoop.hdfs.MiniDFSCluster.<init>(MiniDFSCluster.java:176)
	at org.apache.hadoop.hdfs.MiniDFSCluster.<init>(MiniDFSCluster.java:71)
	at org.apache.hadoop.hdfs.MiniDFSCluster$Builder.build(MiniDFSCluster.java:168)
	at org.apache.hadoop.hdfs.TestFileConcurrentReader.init(TestFileConcurrentReader.java:88)
	at org.apache.hadoop.hdfs.TestFileConcurrentReader.setUp(TestFileConcurrentReader.java:73)


FAILED:  org.apache.hadoop.hdfs.TestFileConcurrentReader.testUnfinishedBlockCRCErrorNormalTransferVerySmallWrite

Error Message:
Cannot lock storage /grid/0/hudson/hudson-slave/workspace/Hadoop-Hdfs-22-branch/trunk/build/test/data/dfs/name1.
The directory is already locked.

Stack Trace:
java.io.IOException: Cannot lock storage /grid/0/hudson/hudson-slave/workspace/Hadoop-Hdfs-22-branch/trunk/build/test/data/dfs/name1.
The directory is already locked.
	at org.apache.hadoop.hdfs.server.common.Storage$StorageDirectory.lock(Storage.java:615)
	at org.apache.hadoop.hdfs.server.namenode.FSImage.format(FSImage.java:1332)
	at org.apache.hadoop.hdfs.server.namenode.FSImage.format(FSImage.java:1350)
	at org.apache.hadoop.hdfs.server.namenode.NameNode.format(NameNode.java:1403)
	at org.apache.hadoop.hdfs.server.namenode.NameNode.format(NameNode.java:201)
	at org.apache.hadoop.hdfs.MiniDFSCluster.initMiniDFSCluster(MiniDFSCluster.java:435)
	at org.apache.hadoop.hdfs.MiniDFSCluster.<init>(MiniDFSCluster.java:176)
	at org.apache.hadoop.hdfs.MiniDFSCluster.<init>(MiniDFSCluster.java:71)
	at org.apache.hadoop.hdfs.MiniDFSCluster$Builder.build(MiniDFSCluster.java:168)
	at org.apache.hadoop.hdfs.TestFileConcurrentReader.init(TestFileConcurrentReader.java:88)
	at org.apache.hadoop.hdfs.TestFileConcurrentReader.setUp(TestFileConcurrentReader.java:73)


FAILED:  org.apache.hadoop.hdfs.server.namenode.TestStorageRestore.testStorageRestore

Error Message:
Image file /grid/0/hudson/hudson-slave/workspace/Hadoop-Hdfs-22-branch/trunk/build/test/data/dfs/secondary/current/fsimage
is corrupt with MD5 checksum of 557ee89b88130e4bda193a26e45b995e but expecting 246f78d05d6150e4396e213e30ebb16e

Stack Trace:
java.io.IOException: Image file /grid/0/hudson/hudson-slave/workspace/Hadoop-Hdfs-22-branch/trunk/build/test/data/dfs/secondary/current/fsimage
is corrupt with MD5 checksum of 557ee89b88130e4bda193a26e45b995e but expecting 246f78d05d6150e4396e213e30ebb16e
	at org.apache.hadoop.hdfs.server.namenode.FSImage.loadFSImage(FSImage.java:1062)
	at org.apache.hadoop.hdfs.server.namenode.SecondaryNameNode$CheckpointStorage.doMerge(SecondaryNameNode.java:678)
	at org.apache.hadoop.hdfs.server.namenode.SecondaryNameNode$CheckpointStorage.access$500(SecondaryNameNode.java:583)
	at org.apache.hadoop.hdfs.server.namenode.SecondaryNameNode.doMerge(SecondaryNameNode.java:460)
	at org.apache.hadoop.hdfs.server.namenode.SecondaryNameNode.doCheckpoint(SecondaryNameNode.java:424)
	at org.apache.hadoop.hdfs.server.namenode.TestStorageRestore.__CLR3_0_2dn2tm410tl(TestStorageRestore.java:316)
	at org.apache.hadoop.hdfs.server.namenode.TestStorageRestore.testStorageRestore(TestStorageRestore.java:286)




Mime
View raw message