hadoop-hdfs-dev mailing list archives

Site index · List index
Message view « Date » · « Thread »
Top « Date » · « Thread »
From Apache Hudson Server <hud...@hudson.apache.org>
Subject Hadoop-Hdfs-trunk - Build # 512 - Still Failing
Date Mon, 06 Dec 2010 15:23:32 GMT
See https://hudson.apache.org/hudson/job/Hadoop-Hdfs-trunk/512/

###################################################################################
########################## LAST 60 LINES OF THE CONSOLE ###########################
[...truncated 1045 lines...]
ivy-init:
[ivy:configure] :: Ivy 2.1.0 - 20090925235825 :: http://ant.apache.org/ivy/ ::
[ivy:configure] :: loading settings :: file = /grid/0/hudson/hudson-slave/workspace/Hadoop-Hdfs-trunk/trunk/ivy/ivysettings.xml

ivy-resolve-common:
[ivy:resolve] downloading https://repository.apache.org/content/repositories/snapshots/org/apache/hadoop/hadoop-common/0.23.0-SNAPSHOT/hadoop-common-0.23.0-20101203.230226-14.jar
...
[ivy:resolve] .....................................................................................
[ivy:resolve] .....................................................................................................................
(1358kB)
[ivy:resolve] .. (0kB)
[ivy:resolve] 	[SUCCESSFUL ] org.apache.hadoop#hadoop-common;0.23.0-SNAPSHOT!hadoop-common.jar
(2193ms)
[ivy:resolve] downloading http://repo1.maven.org/maven2/org/apache/hadoop/avro/1.3.2/avro-1.3.2.jar
...
[ivy:resolve] ......................................................................................................................................................................................................
(331kB)
[ivy:resolve] .. (0kB)
[ivy:resolve] 
[ivy:resolve] :: problems summary ::
[ivy:resolve] :::: WARNINGS
[ivy:resolve] 		[FAILED     ] org.apache.hadoop#avro;1.3.2!avro.jar: invalid sha1: expected=7b6858e308cb0aee4b565442ef05563c9f62fca1
computed=da39a3ee5e6b4b0d3255bfef95601890afd80709 (2177ms)
[ivy:resolve] 		[FAILED     ] org.apache.hadoop#avro;1.3.2!avro.jar:  (0ms)
[ivy:resolve] 	==== apache-snapshot: tried
[ivy:resolve] 	  https://repository.apache.org/content/repositories/snapshots/org/apache/hadoop/avro/1.3.2/avro-1.3.2.jar
[ivy:resolve] 	==== maven2: tried
[ivy:resolve] 	  http://repo1.maven.org/maven2/org/apache/hadoop/avro/1.3.2/avro-1.3.2.jar
[ivy:resolve] 		::::::::::::::::::::::::::::::::::::::::::::::
[ivy:resolve] 		::              FAILED DOWNLOADS            ::
[ivy:resolve] 		:: ^ see resolution messages for details  ^ ::
[ivy:resolve] 		::::::::::::::::::::::::::::::::::::::::::::::
[ivy:resolve] 		:: org.apache.hadoop#avro;1.3.2!avro.jar
[ivy:resolve] 		::::::::::::::::::::::::::::::::::::::::::::::
[ivy:resolve] 
[ivy:resolve] :: USE VERBOSE OR DEBUG MESSAGE LEVEL FOR MORE DETAILS

BUILD FAILED
/grid/0/hudson/hudson-slave/workspace/Hadoop-Hdfs-trunk/trunk/build.xml:1716: impossible to
resolve dependencies:
	resolve failed - see output for details

Total time: 13 seconds


======================================================================
======================================================================
STORE: saving artifacts
======================================================================
======================================================================


mv: cannot stat `build/*.tar.gz': No such file or directory
mv: cannot stat `build/*.jar': No such file or directory
mv: cannot stat `build/test/findbugs': No such file or directory
mv: cannot stat `build/docs/api': No such file or directory
Build Failed
[FINDBUGS] Skipping publisher since build result is FAILURE
Publishing Javadoc
Archiving artifacts
Recording test results
Recording fingerprints
Publishing Clover coverage report...
No Clover report will be published due to a Build Failure
Email was triggered for: Failure
Sending email for trigger: Failure



###################################################################################
############################## FAILED TESTS (if any) ##############################
No tests ran.

Mime
View raw message