hadoop-hdfs-dev mailing list archives

Site index · List index
Message view « Date » · « Thread »
Top « Date » · « Thread »
From Apache Hudson Server <hud...@hudson.apache.org>
Subject Hadoop-Hdfs-21-Build - Build # 132 - Still Failing
Date Mon, 06 Dec 2010 15:23:30 GMT
See https://hudson.apache.org/hudson/job/Hadoop-Hdfs-21-Build/132/

###################################################################################
########################## LAST 60 LINES OF THE CONSOLE ###########################
[...truncated 895 lines...]
     [echo]   

clover:

ivy-download:
      [get] Getting: http://repo2.maven.org/maven2/org/apache/ivy/ivy/2.1.0/ivy-2.1.0.jar
      [get] To: /grid/0/hudson/hudson-slave/workspace/Hadoop-Hdfs-21-Build/trunk/ivy/ivy-2.1.0.jar

ivy-init-dirs:
    [mkdir] Created dir: /grid/0/hudson/hudson-slave/workspace/Hadoop-Hdfs-21-Build/trunk/build/ivy
    [mkdir] Created dir: /grid/0/hudson/hudson-slave/workspace/Hadoop-Hdfs-21-Build/trunk/build/ivy/lib
    [mkdir] Created dir: /grid/0/hudson/hudson-slave/workspace/Hadoop-Hdfs-21-Build/trunk/build/ivy/report
    [mkdir] Created dir: /grid/0/hudson/hudson-slave/workspace/Hadoop-Hdfs-21-Build/trunk/build/ivy/maven

ivy-probe-antlib:

ivy-init-antlib:

ivy-init:
[ivy:configure] :: Ivy 2.1.0 - 20090925235825 :: http://ant.apache.org/ivy/ ::
[ivy:configure] :: loading settings :: file = /grid/0/hudson/hudson-slave/workspace/Hadoop-Hdfs-21-Build/trunk/ivy/ivysettings.xml

ivy-resolve-common:
[ivy:resolve] downloading https://repository.apache.org/content/repositories/snapshots/org/apache/hadoop/hadoop-common/0.21.0-SNAPSHOT/hadoop-common-0.21.0-20101120.093342-38.jar
...
[ivy:resolve] ...........................................................................................................................................................................................
(1259kB)
[ivy:resolve] .. (0kB)
[ivy:resolve] 	[SUCCESSFUL ] org.apache.hadoop#hadoop-common;0.21.0-SNAPSHOT!hadoop-common.jar
(2588ms)
[ivy:resolve] downloading http://repo1.maven.org/maven2/org/apache/hadoop/avro/1.3.2/avro-1.3.2.jar
...
[ivy:resolve] ....................................................
[ivy:resolve] 
[ivy:resolve] :: problems summary ::
[ivy:resolve] :::: WARNINGS
[ivy:resolve] 		[FAILED     ] org.apache.hadoop#avro;1.3.2!avro.jar: Stale NFS file handle
(1868ms)
[ivy:resolve] 		[FAILED     ] org.apache.hadoop#avro;1.3.2!avro.jar:  (0ms)
[ivy:resolve] 	==== apache-snapshot: tried
[ivy:resolve] 	  https://repository.apache.org/content/repositories/snapshots/org/apache/hadoop/avro/1.3.2/avro-1.3.2.jar
[ivy:resolve] 	==== maven2: tried
[ivy:resolve] 	  http://repo1.maven.org/maven2/org/apache/hadoop/avro/1.3.2/avro-1.3.2.jar
[ivy:resolve] 		::::::::::::::::::::::::::::::::::::::::::::::
[ivy:resolve] 		::              FAILED DOWNLOADS            ::
[ivy:resolve] 		:: ^ see resolution messages for details  ^ ::
[ivy:resolve] 		::::::::::::::::::::::::::::::::::::::::::::::
[ivy:resolve] 		:: org.apache.hadoop#avro;1.3.2!avro.jar
[ivy:resolve] 		::::::::::::::::::::::::::::::::::::::::::::::
[ivy:resolve] 
[ivy:resolve] :: USE VERBOSE OR DEBUG MESSAGE LEVEL FOR MORE DETAILS

BUILD FAILED
/grid/0/hudson/hudson-slave/workspace/Hadoop-Hdfs-21-Build/trunk/build.xml:1664: impossible
to resolve dependencies:
	resolve failed - see output for details

Total time: 13 seconds
Publishing Javadoc
Archiving artifacts
Recording test results
Recording fingerprints
Description set: 
Email was triggered for: Failure
Sending email for trigger: Failure



###################################################################################
############################## FAILED TESTS (if any) ##############################
No tests ran.

Mime
View raw message