hadoop-hdfs-dev mailing list archives

Site index · List index
Message view « Date » · « Thread »
Top « Date » · « Thread »
From Apache Hudson Server <hud...@hudson.apache.org>
Subject Hadoop-Hdfs-22-branch - Build # 6 - Still Failing
Date Thu, 23 Dec 2010 15:40:02 GMT
See https://hudson.apache.org/hudson/job/Hadoop-Hdfs-22-branch/6/

###################################################################################
########################## LAST 60 LINES OF THE CONSOLE ###########################
[...truncated 3003 lines...]
    [junit] Running org.apache.hadoop.hdfs.server.common.TestDistributedUpgrade
    [junit] Tests run: 1, Failures: 0, Errors: 0, Time elapsed: 31.453 sec
    [junit] Running org.apache.hadoop.hdfs.server.common.TestGetUriFromString
    [junit] Tests run: 3, Failures: 0, Errors: 0, Time elapsed: 0.151 sec
    [junit] Running org.apache.hadoop.hdfs.server.common.TestJspHelper
    [junit] Tests run: 2, Failures: 0, Errors: 0, Time elapsed: 0.79 sec
    [junit] Running org.apache.hadoop.hdfs.server.datanode.TestBlockReport
    [junit] Tests run: 7, Failures: 0, Errors: 0, Time elapsed: 49.927 sec
    [junit] Running org.apache.hadoop.hdfs.server.datanode.TestDataNodeMXBean
    [junit] Tests run: 1, Failures: 0, Errors: 0, Time elapsed: 2.429 sec
    [junit] Running org.apache.hadoop.hdfs.server.datanode.TestDataNodeMetrics
    [junit] Tests run: 1, Failures: 0, Errors: 0, Time elapsed: 29.054 sec
    [junit] Running org.apache.hadoop.hdfs.server.datanode.TestDataNodeVolumeFailure
    [junit] Tests run: 1, Failures: 0, Errors: 0, Time elapsed: 3.484 sec
    [junit] Running org.apache.hadoop.hdfs.server.datanode.TestDataNodeVolumeFailureReporting
    [junit] Tests run: 3, Failures: 0, Errors: 0, Time elapsed: 71.635 sec
    [junit] Running org.apache.hadoop.hdfs.server.datanode.TestDataXceiver
    [junit] Tests run: 1, Failures: 0, Errors: 0, Time elapsed: 2.557 sec
    [junit] Running org.apache.hadoop.hdfs.server.datanode.TestDatanodeRestart
    [junit] Tests run: 2, Failures: 0, Errors: 0, Time elapsed: 5.804 sec
    [junit] Running org.apache.hadoop.hdfs.server.datanode.TestReplicasMap
    [junit] Tests run: 3, Failures: 0, Errors: 0, Time elapsed: 0.085 sec
    [junit] Running org.apache.hadoop.hdfs.server.datanode.TestWriteToReplica
    [junit] Tests run: 4, Failures: 0, Errors: 0, Time elapsed: 5.204 sec
    [junit] Running org.apache.hadoop.hdfs.server.namenode.TestAllowFormat
    [junit] Tests run: 1, Failures: 0, Errors: 0, Time elapsed: 2.273 sec
    [junit] Running org.apache.hadoop.hdfs.server.namenode.TestBlockTokenWithDFS
    [junit] Tests run: 4, Failures: 0, Errors: 0, Time elapsed: 35.492 sec
    [junit] Running org.apache.hadoop.hdfs.server.namenode.TestBlockUnderConstruction
    [junit] Tests run: 2, Failures: 0, Errors: 0, Time elapsed: 3.377 sec
    [junit] Running org.apache.hadoop.hdfs.server.namenode.TestBlocksWithNotEnoughRacks
    [junit] Tests run: 2, Failures: 0, Errors: 0, Time elapsed: 7.921 sec
    [junit] Running org.apache.hadoop.hdfs.server.namenode.TestCheckPointForSecurityTokens
    [junit] Tests run: 1, Failures: 0, Errors: 0, Time elapsed: 7.338 sec
    [junit] Running org.apache.hadoop.hdfs.server.namenode.TestCorruptFilesJsp
    [junit] Tests run: 1, Failures: 0, Errors: 0, Time elapsed: 8.212 sec
    [junit] Running org.apache.hadoop.hdfs.server.namenode.TestCorruptReplicaInfo
    [junit] Tests run: 1, Failures: 0, Errors: 0, Time elapsed: 0.228 sec
    [junit] Running org.apache.hadoop.hdfs.server.namenode.TestDeadDatanode
    [junit] Tests run: 1, Failures: 0, Errors: 0, Time elapsed: 16.29 sec
    [junit] Running org.apache.hadoop.hdfs.server.namenode.TestDecommissioningStatus
    [junit] Tests run: 1, Failures: 0, Errors: 0, Time elapsed: 17.879 sec
    [junit] Running org.apache.hadoop.hdfs.server.namenode.TestEditLogRace
    [junit] Tests run: 4, Failures: 0, Errors: 0, Time elapsed: 30.382 sec
    [junit] Running org.apache.hadoop.hdfs.server.namenode.TestFsck
    [junit] Tests run: 8, Failures: 0, Errors: 0, Time elapsed: 34.835 sec
    [junit] Running org.apache.hadoop.hdfs.server.namenode.TestHDFSConcat
    [junit] Tests run: 3, Failures: 0, Errors: 0, Time elapsed: 6.63 sec
    [junit] Running org.apache.hadoop.hdfs.server.namenode.TestLargeDirectoryDelete
Build timed out. Aborting
[FINDBUGS] Skipping publisher since build result is FAILURE
Publishing Javadoc
Archiving artifacts
Recording test results
Recording fingerprints
Publishing Clover coverage report...
No Clover report will be published due to a Build Failure
Email was triggered for: Failure
Sending email for trigger: Failure



###################################################################################
############################## FAILED TESTS (if any) ##############################
3 tests failed.
FAILED:  TEST-org.apache.hadoop.hdfs.server.namenode.TestLargeDirectoryDelete.xml.<init>

Error Message:


Stack Trace:
Test report file /grid/0/hudson/hudson-slave/workspace/Hadoop-Hdfs-22-branch/trunk/build/test/TEST-org.apache.hadoop.hdfs.server.namenode.TestLargeDirectoryDelete.xml
was length 0

FAILED:  org.apache.hadoop.hdfs.TestFileConcurrentReader.testUnfinishedBlockCRCErrorNormalTransferVerySmallWrite

Error Message:
Too many open files

Stack Trace:
java.io.IOException: Too many open files
	at sun.nio.ch.IOUtil.initPipe(Native Method)
	at sun.nio.ch.EPollSelectorImpl.<init>(EPollSelectorImpl.java:49)
	at sun.nio.ch.EPollSelectorProvider.openSelector(EPollSelectorProvider.java:18)
	at java.nio.channels.Selector.open(Selector.java:209)
	at org.apache.hadoop.ipc.Server$Listener.<init>(Server.java:318)
	at org.apache.hadoop.ipc.Server.<init>(Server.java:1492)
	at org.apache.hadoop.ipc.RPC$Server.<init>(RPC.java:394)
	at org.apache.hadoop.ipc.WritableRpcEngine$Server.<init>(WritableRpcEngine.java:331)
	at org.apache.hadoop.ipc.WritableRpcEngine.getServer(WritableRpcEngine.java:291)
	at org.apache.hadoop.ipc.WritableRpcEngine.getServer(WritableRpcEngine.java:47)
	at org.apache.hadoop.ipc.RPC.getServer(RPC.java:382)
	at org.apache.hadoop.hdfs.server.datanode.DataNode.initIpcServer(DataNode.java:416)
	at org.apache.hadoop.hdfs.server.datanode.DataNode.startDataNode(DataNode.java:507)
	at org.apache.hadoop.hdfs.server.datanode.DataNode.<init>(DataNode.java:281)
	at org.apache.hadoop.hdfs.server.datanode.DataNode.<init>(DataNode.java:263)
	at org.apache.hadoop.hdfs.server.datanode.DataNode.makeInstance(DataNode.java:1561)
	at org.apache.hadoop.hdfs.server.datanode.DataNode.instantiateDataNode(DataNode.java:1504)
	at org.apache.hadoop.hdfs.server.datanode.DataNode.instantiateDataNode(DataNode.java:1471)
	at org.apache.hadoop.hdfs.MiniDFSCluster.startDataNodes(MiniDFSCluster.java:614)
	at org.apache.hadoop.hdfs.MiniDFSCluster.initMiniDFSCluster(MiniDFSCluster.java:448)
	at org.apache.hadoop.hdfs.MiniDFSCluster.<init>(MiniDFSCluster.java:176)
	at org.apache.hadoop.hdfs.MiniDFSCluster.<init>(MiniDFSCluster.java:71)
	at org.apache.hadoop.hdfs.MiniDFSCluster$Builder.build(MiniDFSCluster.java:168)
	at org.apache.hadoop.hdfs.TestFileConcurrentReader.init(TestFileConcurrentReader.java:88)
	at org.apache.hadoop.hdfs.TestFileConcurrentReader.setUp(TestFileConcurrentReader.java:73)


FAILED:  org.apache.hadoop.hdfs.server.namenode.TestStorageRestore.testStorageRestore

Error Message:
Image file /grid/0/hudson/hudson-slave/workspace/Hadoop-Hdfs-22-branch/trunk/build/test/data/dfs/secondary/current/fsimage
is corrupt with MD5 checksum of 053d4feec1ab8d119cef4bbd1e058db0 but expecting 8dfbd8c71b1fe8e72a0d139dc66143fb

Stack Trace:
java.io.IOException: Image file /grid/0/hudson/hudson-slave/workspace/Hadoop-Hdfs-22-branch/trunk/build/test/data/dfs/secondary/current/fsimage
is corrupt with MD5 checksum of 053d4feec1ab8d119cef4bbd1e058db0 but expecting 8dfbd8c71b1fe8e72a0d139dc66143fb
	at org.apache.hadoop.hdfs.server.namenode.FSImage.loadFSImage(FSImage.java:1062)
	at org.apache.hadoop.hdfs.server.namenode.SecondaryNameNode$CheckpointStorage.doMerge(SecondaryNameNode.java:678)
	at org.apache.hadoop.hdfs.server.namenode.SecondaryNameNode$CheckpointStorage.access$500(SecondaryNameNode.java:583)
	at org.apache.hadoop.hdfs.server.namenode.SecondaryNameNode.doMerge(SecondaryNameNode.java:460)
	at org.apache.hadoop.hdfs.server.namenode.SecondaryNameNode.doCheckpoint(SecondaryNameNode.java:424)
	at org.apache.hadoop.hdfs.server.namenode.TestStorageRestore.__CLR3_0_2dn2tm410tm(TestStorageRestore.java:316)
	at org.apache.hadoop.hdfs.server.namenode.TestStorageRestore.testStorageRestore(TestStorageRestore.java:286)




Mime
View raw message