hadoop-hdfs-dev mailing list archives

Site index · List index
Message view « Date » · « Thread »
Top « Date » · « Thread »
From Apache Hudson Server <hud...@hudson.apache.org>
Subject Hadoop-Hdfs-trunk-Commit - Build # 501 - Still Failing
Date Thu, 23 Dec 2010 05:22:26 GMT
See https://hudson.apache.org/hudson/job/Hadoop-Hdfs-trunk-Commit/501/

###################################################################################
########################## LAST 60 LINES OF THE CONSOLE ###########################
[...truncated 976 lines...]
======================================================================
BUILD: ant veryclean mvn-deploy tar findbugs -Dtest.junit.output.format=xml -Dtest.output=yes
-Dcompile.c++=true -Dcompile.native=true -Dfindbugs.home=$FINDBUGS_HOME -Djava5.home=$JAVA5_HOME
-Dforrest.home=$FORREST_HOME -Dclover.home=$CLOVER_HOME -Declipse.home=$ECLIPSE_HOME
======================================================================
======================================================================


Buildfile: build.xml

clean-contrib:

clean:

check-libhdfs-fuse:

clean:
Trying to override old definition of task macro_tar

clean:
     [echo] contrib: hdfsproxy

clean:
     [echo] contrib: thriftfs

clean-fi:

clean-sign:

clean:

clean-cache:
   [delete] Deleting directory /homes/hudson/.ivy2/cache/org.apache.hadoop

BUILD FAILED
/grid/0/hudson/hudson-slave/workspace/Hadoop-Hdfs-trunk-Commit/trunk/build.xml:1251: Unable
to delete directory /homes/hudson/.ivy2/cache/org.apache.hadoop

Total time: 0 seconds


======================================================================
======================================================================
STORE: saving artifacts
======================================================================
======================================================================


mv: cannot stat `build/*.tar.gz': No such file or directory
mv: cannot stat `build/*.jar': No such file or directory
mv: cannot stat `build/test/findbugs': No such file or directory
mv: cannot stat `build/docs/api': No such file or directory
Build Failed
[FINDBUGS] Skipping publisher since build result is FAILURE
Publishing Javadoc
Archiving artifacts
Recording test results
Recording fingerprints
Publishing Clover coverage report...
No Clover report will be published due to a Build Failure
Email was triggered for: Failure
Sending email for trigger: Failure



###################################################################################
############################## FAILED TESTS (if any) ##############################
No tests ran.

Mime
View raw message