hadoop-hdfs-dev mailing list archives

Site index · List index
Message view « Date » · « Thread »
Top « Date » · « Thread »
From Apache Hudson Server <hud...@hudson.apache.org>
Subject Build failed in Hudson: Hadoop-Hdfs-trunk-Commit #469
Date Wed, 24 Nov 2010 06:19:09 GMT
See <https://hudson.apache.org/hudson/job/Hadoop-Hdfs-trunk-Commit/469/>

------------------------------------------
[...truncated 2441 lines...]

ivy-init:

ivy-resolve-common:

ivy-retrieve-common:

init:
    [touch] Creating /tmp/null1981533946
   [delete] Deleting: /tmp/null1981533946

compile-hdfs-classes:
[paranamer] Generating parameter names from <https://hudson.apache.org/hudson/job/Hadoop-Hdfs-trunk-Commit/ws/trunk/src/java/org/apache/hadoop/hdfs/protocol>
to <https://hudson.apache.org/hudson/job/Hadoop-Hdfs-trunk-Commit/ws/trunk/build/classes>
[paranamer] Generating parameter names from <https://hudson.apache.org/hudson/job/Hadoop-Hdfs-trunk-Commit/ws/trunk/src/java/org/apache/hadoop/hdfs/server/protocol>
to <https://hudson.apache.org/hudson/job/Hadoop-Hdfs-trunk-Commit/ws/trunk/build/classes>

compile-core:

jar:
      [jar] Building jar: <https://hudson.apache.org/hudson/job/Hadoop-Hdfs-trunk-Commit/ws/trunk/build/hadoop-hdfs-0.23.0-SNAPSHOT.jar>

findbugs:
    [mkdir] Created dir: <https://hudson.apache.org/hudson/job/Hadoop-Hdfs-trunk-Commit/ws/trunk/build/test/findbugs>
 [findbugs] Executing findbugs from ant task
 [findbugs] Running FindBugs...
 [findbugs] Calculating exit code...
 [findbugs] Exit code set to: 0
 [findbugs] Output saved to <https://hudson.apache.org/hudson/job/Hadoop-Hdfs-trunk-Commit/ws/trunk/build/test/findbugs/hadoop-findbugs-report.xml>
     [xslt] Processing <https://hudson.apache.org/hudson/job/Hadoop-Hdfs-trunk-Commit/ws/trunk/build/test/findbugs/hadoop-findbugs-report.xml>
to <https://hudson.apache.org/hudson/job/Hadoop-Hdfs-trunk-Commit/ws/trunk/build/test/findbugs/hadoop-findbugs-report.html>
     [xslt] Loading stylesheet /homes/gkesavan/tools/findbugs/latest/src/xsl/default.xsl

BUILD SUCCESSFUL
Total time: 6 minutes 0 seconds


======================================================================
======================================================================
STORE: saving artifacts
======================================================================
======================================================================




======================================================================
======================================================================
CLEAN: cleaning workspace
======================================================================
======================================================================


Buildfile: build.xml

clean-contrib:

clean:

check-libhdfs-fuse:

clean:
Trying to override old definition of task macro_tar

clean:
     [echo] contrib: hdfsproxy
   [delete] Deleting directory <https://hudson.apache.org/hudson/job/Hadoop-Hdfs-trunk-Commit/ws/trunk/build/contrib/hdfsproxy>

clean:
     [echo] contrib: thriftfs
   [delete] Deleting directory <https://hudson.apache.org/hudson/job/Hadoop-Hdfs-trunk-Commit/ws/trunk/build/contrib/thriftfs>

clean-fi:
   [delete] Deleting directory <https://hudson.apache.org/hudson/job/Hadoop-Hdfs-trunk-Commit/ws/trunk/build-fi>

clean-sign:

clean:
   [delete] Deleting directory <https://hudson.apache.org/hudson/job/Hadoop-Hdfs-trunk-Commit/ws/trunk/build>
   [delete] Deleting directory <https://hudson.apache.org/hudson/job/Hadoop-Hdfs-trunk-Commit/ws/trunk/src/docs/build>
   [delete] Deleting: <https://hudson.apache.org/hudson/job/Hadoop-Hdfs-trunk-Commit/ws/trunk/ivy/hadoop-hdfs.xml>
   [delete] Deleting: <https://hudson.apache.org/hudson/job/Hadoop-Hdfs-trunk-Commit/ws/trunk/ivy/hadoop-hdfs-test.xml>
   [delete] Deleting: <https://hudson.apache.org/hudson/job/Hadoop-Hdfs-trunk-Commit/ws/trunk/ivy/hadoop-hdfs-instrumented.xml>
   [delete] Deleting: <https://hudson.apache.org/hudson/job/Hadoop-Hdfs-trunk-Commit/ws/trunk/ivy/hadoop-hdfs-instrumented-test.xml>

BUILD SUCCESSFUL
Total time: 1 second


======================================================================
======================================================================
ANALYSIS: ant -Drun.clover=true clover checkstyle run-commit-test generate-clover-reports
-Dtest.junit.output.format=xml -Dtest.output=no -Dcompile.c++=true -Dcompile.native=true -Dfindbugs.home=$FINDBUGS_HOME
-Djava5.home=$JAVA5_HOME -Dforrest.home=$FORREST_HOME -Dclover.home=$CLOVER_HOME -Declipse.home=$ECLIPSE_HOME
======================================================================
======================================================================


Buildfile: build.xml

clover.setup:
    [mkdir] Created dir: <https://hudson.apache.org/hudson/job/Hadoop-Hdfs-trunk-Commit/ws/trunk/build/test/clover/db>
[clover-setup] Clover Version 3.0.2, built on April 13 2010 (build-790)
[clover-setup] Loaded from: /homes/hudson/tools/clover/latest/lib/clover.jar
[clover-setup] Clover: Open Source License registered to Apache.
[clover-setup] Clover is enabled with initstring '<https://hudson.apache.org/hudson/job/Hadoop-Hdfs-trunk-Commit/ws/trunk/build/test/clover/db/hadoop_coverage.db'>
     [echo] HDFS-783: test-libhdfs is disabled for Clover'ed builds

clover.info:

clover:

ivy-download:
      [get] Getting: http://repo2.maven.org/maven2/org/apache/ivy/ivy/2.1.0/ivy-2.1.0.jar
      [get] To: <https://hudson.apache.org/hudson/job/Hadoop-Hdfs-trunk-Commit/ws/trunk/ivy/ivy-2.1.0.jar>
      [get] Not modified - so not downloaded

ivy-init-dirs:
    [mkdir] Created dir: <https://hudson.apache.org/hudson/job/Hadoop-Hdfs-trunk-Commit/ws/trunk/build/ivy>
    [mkdir] Created dir: <https://hudson.apache.org/hudson/job/Hadoop-Hdfs-trunk-Commit/ws/trunk/build/ivy/lib>
    [mkdir] Created dir: <https://hudson.apache.org/hudson/job/Hadoop-Hdfs-trunk-Commit/ws/trunk/build/ivy/report>
    [mkdir] Created dir: <https://hudson.apache.org/hudson/job/Hadoop-Hdfs-trunk-Commit/ws/trunk/build/ivy/maven>

ivy-probe-antlib:

ivy-init-antlib:

ivy-init:
[ivy:configure] :: Ivy 2.1.0 - 20090925235825 :: http://ant.apache.org/ivy/ ::
[ivy:configure] :: loading settings :: file = <https://hudson.apache.org/hudson/job/Hadoop-Hdfs-trunk-Commit/ws/trunk/ivy/ivysettings.xml>

ivy-resolve-checkstyle:

ivy-retrieve-checkstyle:
[ivy:cachepath] DEPRECATED: 'ivy.conf.file' is deprecated, use 'ivy.settings.file' instead
[ivy:cachepath] :: loading settings :: file = <https://hudson.apache.org/hudson/job/Hadoop-Hdfs-trunk-Commit/ws/trunk/ivy/ivysettings.xml>

check-for-checkstyle:

checkstyle:
[checkstyle] Running Checkstyle 4.2 on 197 files
     [xslt] Processing <https://hudson.apache.org/hudson/job/Hadoop-Hdfs-trunk-Commit/469/artifact/trunk/build/test/checkstyle-errors.xml>
to <https://hudson.apache.org/hudson/job/Hadoop-Hdfs-trunk-Commit/469/artifact/trunk/build/test/checkstyle-errors.html>
     [xslt] Loading stylesheet <https://hudson.apache.org/hudson/job/Hadoop-Hdfs-trunk-Commit/ws/trunk/src/test/checkstyle-noframes-sorted.xsl>

ivy-download:
      [get] Getting: http://repo2.maven.org/maven2/org/apache/ivy/ivy/2.1.0/ivy-2.1.0.jar
      [get] To: <https://hudson.apache.org/hudson/job/Hadoop-Hdfs-trunk-Commit/ws/trunk/ivy/ivy-2.1.0.jar>
      [get] Not modified - so not downloaded

ivy-init-dirs:

ivy-probe-antlib:

ivy-init-antlib:

ivy-init:

ivy-resolve-common:

ivy-retrieve-common:

init:
    [mkdir] Created dir: <https://hudson.apache.org/hudson/job/Hadoop-Hdfs-trunk-Commit/ws/trunk/build/classes>
    [mkdir] Created dir: <https://hudson.apache.org/hudson/job/Hadoop-Hdfs-trunk-Commit/ws/trunk/build/src>
    [mkdir] Created dir: <https://hudson.apache.org/hudson/job/Hadoop-Hdfs-trunk-Commit/ws/trunk/build/webapps/hdfs/WEB-INF>
    [mkdir] Created dir: <https://hudson.apache.org/hudson/job/Hadoop-Hdfs-trunk-Commit/ws/trunk/build/webapps/datanode/WEB-INF>
    [mkdir] Created dir: <https://hudson.apache.org/hudson/job/Hadoop-Hdfs-trunk-Commit/ws/trunk/build/webapps/secondary/WEB-INF>
    [mkdir] Created dir: <https://hudson.apache.org/hudson/job/Hadoop-Hdfs-trunk-Commit/ws/trunk/build/ant>
    [mkdir] Created dir: <https://hudson.apache.org/hudson/job/Hadoop-Hdfs-trunk-Commit/ws/trunk/build/c++>
    [mkdir] Created dir: <https://hudson.apache.org/hudson/job/Hadoop-Hdfs-trunk-Commit/ws/trunk/build/test/hdfs/classes>
    [mkdir] Created dir: <https://hudson.apache.org/hudson/job/Hadoop-Hdfs-trunk-Commit/ws/trunk/build/test/extraconf>
    [touch] Creating /tmp/null242765010
   [delete] Deleting: /tmp/null242765010
     [copy] Copying 3 files to <https://hudson.apache.org/hudson/job/Hadoop-Hdfs-trunk-Commit/ws/trunk/build/webapps>

compile-hdfs-classes:
    [javac] Compiling 207 source files to <https://hudson.apache.org/hudson/job/Hadoop-Hdfs-trunk-Commit/ws/trunk/build/classes>
   [clover] Clover Version 3.0.2, built on April 13 2010 (build-790)
   [clover] Loaded from: /homes/hudson/tools/clover/latest/lib/clover.jar
   [clover] Clover: Open Source License registered to Apache.
   [clover] Creating new database at '<https://hudson.apache.org/hudson/job/Hadoop-Hdfs-trunk-Commit/ws/trunk/build/test/clover/db/hadoop_coverage.db'.>
   [clover] Processing files at 1.6 source level.
   [clover] Clover all over. Instrumented 197 files (15 packages).
   [clover] Elapsed time = 2.033 secs. (96.901 files/sec, 30,690.113 srclines/sec)
    [javac] Note: Some input files use or override a deprecated API.
    [javac] Note: Recompile with -Xlint:deprecation for details.
[paranamer] Generating parameter names from <https://hudson.apache.org/hudson/job/Hadoop-Hdfs-trunk-Commit/ws/trunk/src/java/org/apache/hadoop/hdfs/protocol>
to <https://hudson.apache.org/hudson/job/Hadoop-Hdfs-trunk-Commit/ws/trunk/build/classes>
[paranamer] Generating parameter names from <https://hudson.apache.org/hudson/job/Hadoop-Hdfs-trunk-Commit/ws/trunk/src/java/org/apache/hadoop/hdfs/server/protocol>
to <https://hudson.apache.org/hudson/job/Hadoop-Hdfs-trunk-Commit/ws/trunk/build/classes>
     [copy] Copying 1 file to <https://hudson.apache.org/hudson/job/Hadoop-Hdfs-trunk-Commit/ws/trunk/build/classes>

ivy-resolve-test:

ivy-retrieve-test:

compile-hdfs-test:
    [javac] Compiling 186 source files to <https://hudson.apache.org/hudson/job/Hadoop-Hdfs-trunk-Commit/ws/trunk/build/test/hdfs/classes>
   [clover] Clover Version 3.0.2, built on April 13 2010 (build-790)
   [clover] Loaded from: /homes/hudson/tools/clover/latest/lib/clover.jar
   [clover] Clover: Open Source License registered to Apache.
   [clover] Updating existing database at '<https://hudson.apache.org/hudson/job/Hadoop-Hdfs-trunk-Commit/ws/trunk/build/test/clover/db/hadoop_coverage.db'.>
   [clover] Processing files at 1.6 source level.
   [clover] Clover all over. Instrumented 186 files (18 packages).
   [clover] 421 test methods detected.
   [clover] Elapsed time = 1.49 secs. (124.832 files/sec, 29,434.229 srclines/sec)
    [javac] Note: Some input files use or override a deprecated API.
    [javac] Note: Recompile with -Xlint:deprecation for details.
    [mkdir] Created dir: <https://hudson.apache.org/hudson/job/Hadoop-Hdfs-trunk-Commit/ws/trunk/build/test/cache>
     [copy] Copying 1 file to <https://hudson.apache.org/hudson/job/Hadoop-Hdfs-trunk-Commit/ws/trunk/build/test/cache>
     [copy] Copying 1 file to <https://hudson.apache.org/hudson/job/Hadoop-Hdfs-trunk-Commit/ws/trunk/build/test/cache>
     [copy] Copying 1 file to <https://hudson.apache.org/hudson/job/Hadoop-Hdfs-trunk-Commit/ws/trunk/build/test/cache>
     [copy] Copying 1 file to <https://hudson.apache.org/hudson/job/Hadoop-Hdfs-trunk-Commit/ws/trunk/build/test/cache>
     [copy] Copying 1 file to <https://hudson.apache.org/hudson/job/Hadoop-Hdfs-trunk-Commit/ws/trunk/build/test/cache>
     [copy] Copying 1 file to <https://hudson.apache.org/hudson/job/Hadoop-Hdfs-trunk-Commit/ws/trunk/build/test/cache>
     [copy] Copying 1 file to <https://hudson.apache.org/hudson/job/Hadoop-Hdfs-trunk-Commit/ws/trunk/build/test/cache>
     [copy] Copying 1 file to <https://hudson.apache.org/hudson/job/Hadoop-Hdfs-trunk-Commit/ws/trunk/build/test/cache>
     [copy] Copying 1 file to <https://hudson.apache.org/hudson/job/Hadoop-Hdfs-trunk-Commit/ws/trunk/build/test/cache>
     [copy] Copying 1 file to <https://hudson.apache.org/hudson/job/Hadoop-Hdfs-trunk-Commit/ws/trunk/build/test/cache>

run-commit-test:
    [mkdir] Created dir: <https://hudson.apache.org/hudson/job/Hadoop-Hdfs-trunk-Commit/ws/trunk/build/test/data>
    [mkdir] Created dir: <https://hudson.apache.org/hudson/job/Hadoop-Hdfs-trunk-Commit/ws/trunk/build/test/logs>
     [copy] Copying 1 file to <https://hudson.apache.org/hudson/job/Hadoop-Hdfs-trunk-Commit/ws/trunk/build/test/extraconf>
     [copy] Copying 1 file to <https://hudson.apache.org/hudson/job/Hadoop-Hdfs-trunk-Commit/ws/trunk/build/test/extraconf>
    [junit] WARNING: multiple versions of ant detected in path for junit 
    [junit]          jar:file:/homes/hudson/tools/ant/latest/lib/ant.jar!/org/apache/tools/ant/Project.class
    [junit]      and jar:file:/homes/hudson/.ivy2/cache/ant/ant/jars/ant-1.6.5.jar!/org/apache/tools/ant/Project.class
    [junit] Running org.apache.hadoop.hdfs.server.datanode.TestBlockRecovery
    [junit] Tests run: 12, Failures: 0, Errors: 6, Time elapsed: 5.07 sec
    [junit] Test org.apache.hadoop.hdfs.server.datanode.TestBlockRecovery FAILED
    [junit] Running org.apache.hadoop.hdfs.server.datanode.TestDataDirs
    [junit] Tests run: 1, Failures: 0, Errors: 0, Time elapsed: 0.479 sec
    [junit] Running org.apache.hadoop.hdfs.server.namenode.TestGetImageServlet
    [junit] Tests run: 2, Failures: 0, Errors: 0, Time elapsed: 0.46 sec
    [junit] Running org.apache.hadoop.hdfs.server.namenode.TestINodeFile
    [junit] Tests run: 6, Failures: 0, Errors: 0, Time elapsed: 0.241 sec
    [junit] Running org.apache.hadoop.hdfs.server.namenode.TestNNLeaseRecovery
    [junit] Tests run: 11, Failures: 0, Errors: 0, Time elapsed: 2.311 sec

checkfailure:
    [touch] Creating <https://hudson.apache.org/hudson/job/Hadoop-Hdfs-trunk-Commit/ws/trunk/build/test/testsfailed>

BUILD FAILED
<https://hudson.apache.org/hudson/job/Hadoop-Hdfs-trunk-Commit/ws/trunk/build.xml>:674:
The following error occurred while executing this line:
<https://hudson.apache.org/hudson/job/Hadoop-Hdfs-trunk-Commit/ws/trunk/build.xml>:637:
The following error occurred while executing this line:
<https://hudson.apache.org/hudson/job/Hadoop-Hdfs-trunk-Commit/ws/trunk/build.xml>:705:
Tests failed!

Total time: 34 seconds
[FINDBUGS] Skipping publisher since build result is FAILURE
Publishing Javadoc
Archiving artifacts
Recording test results
Recording fingerprints
Publishing Clover coverage report...
No Clover report will be published due to a Build Failure


Mime
View raw message