hadoop-hdfs-dev mailing list archives

Site index · List index
Message view « Date » · « Thread »
Top « Date » · « Thread »
From Apache Hudson Server <hud...@hudson.apache.org>
Subject Hadoop-Hdfs-21-Build - Build # 129 - Still Failing
Date Wed, 24 Nov 2010 08:09:46 GMT
See https://hudson.apache.org/hudson/job/Hadoop-Hdfs-21-Build/129/

###################################################################################
########################## LAST 60 LINES OF THE CONSOLE ###########################
[...truncated 3369 lines...]
    [junit]          jar:file:/homes/hudson/tools/ant/latest/lib/ant.jar!/org/apache/tools/ant/Project.class
    [junit]      and jar:file:/homes/hudson/.ivy2/cache/ant/ant/jars/ant-1.6.5.jar!/org/apache/tools/ant/Project.class
    [junit] Running org.apache.hadoop.fs.TestFiListPath
    [junit] Tests run: 1, Failures: 0, Errors: 0, Time elapsed: 1.9 sec
    [junit] Running org.apache.hadoop.fs.TestFiRename
    [junit] Tests run: 4, Failures: 0, Errors: 0, Time elapsed: 105.884 sec
    [junit] Running org.apache.hadoop.hdfs.TestFiHFlush
    [junit] Tests run: 9, Failures: 0, Errors: 0, Time elapsed: 49.583 sec
    [junit] Running org.apache.hadoop.hdfs.TestFiPipelines
    [junit] Tests run: 3, Failures: 0, Errors: 0, Time elapsed: 34.09 sec
    [junit] Running org.apache.hadoop.hdfs.server.datanode.TestFiDataTransferProtocol
    [junit] Tests run: 29, Failures: 0, Errors: 0, Time elapsed: 254.395 sec
    [junit] Running org.apache.hadoop.hdfs.server.datanode.TestFiDataTransferProtocol2
    [junit] Tests run: 10, Failures: 0, Errors: 0, Time elapsed: 410.537 sec
    [junit] Running org.apache.hadoop.hdfs.server.datanode.TestFiPipelineClose
    [junit] Tests run: 3, Failures: 0, Errors: 0, Time elapsed: 66.64 sec

checkfailure:

run-test-hdfs-excluding-commit-and-smoke:
   [delete] Deleting directory /grid/0/hudson/hudson-slave/workspace/Hadoop-Hdfs-21-Build/trunk/build-fi/test/data
    [mkdir] Created dir: /grid/0/hudson/hudson-slave/workspace/Hadoop-Hdfs-21-Build/trunk/build-fi/test/data
   [delete] Deleting directory /grid/0/hudson/hudson-slave/workspace/Hadoop-Hdfs-21-Build/trunk/build-fi/test/logs
    [mkdir] Created dir: /grid/0/hudson/hudson-slave/workspace/Hadoop-Hdfs-21-Build/trunk/build-fi/test/logs
    [junit] WARNING: multiple versions of ant detected in path for junit 
    [junit]          jar:file:/homes/hudson/tools/ant/latest/lib/ant.jar!/org/apache/tools/ant/Project.class
    [junit]      and jar:file:/homes/hudson/.ivy2/cache/ant/ant/jars/ant-1.6.5.jar!/org/apache/tools/ant/Project.class
    [junit] Running org.apache.hadoop.fs.TestFiListPath
    [junit] Tests run: 1, Failures: 0, Errors: 0, Time elapsed: 40.106 sec
    [junit] Running org.apache.hadoop.fs.TestFiRename
    [junit] Tests run: 4, Failures: 0, Errors: 0, Time elapsed: 107.591 sec
    [junit] Running org.apache.hadoop.hdfs.TestFiHFlush
    [junit] Tests run: 9, Failures: 0, Errors: 0, Time elapsed: 45.262 sec
    [junit] Running org.apache.hadoop.hdfs.TestFiPipelines
    [junit] Tests run: 3, Failures: 0, Errors: 0, Time elapsed: 28.577 sec
    [junit] Running org.apache.hadoop.hdfs.server.datanode.TestFiDataTransferProtocol
    [junit] Tests run: 29, Failures: 0, Errors: 0, Time elapsed: 249.069 sec
    [junit] Running org.apache.hadoop.hdfs.server.datanode.TestFiDataTransferProtocol2
    [junit] Tests run: 10, Failures: 0, Errors: 0, Time elapsed: 436.205 sec
    [junit] Running org.apache.hadoop.hdfs.server.datanode.TestFiPipelineClose
    [junit] Tests run: 3, Failures: 0, Errors: 0, Time elapsed: 71.522 sec

checkfailure:

run-test-hdfs-all-withtestcaseonly:

run-test-hdfs:

BUILD FAILED
/grid/0/hudson/hudson-slave/workspace/Hadoop-Hdfs-21-Build/trunk/build.xml:707: Tests failed!

Total time: 115 minutes 38 seconds
Publishing Javadoc
Archiving artifacts
Recording test results
Recording fingerprints
Description set: 
Email was triggered for: Failure
Sending email for trigger: Failure



###################################################################################
############################## FAILED TESTS (if any) ##############################
101 tests failed.
FAILED:  <init>.org.apache.hadoop.fs.TestFcHdfsCreateMkdir

Error Message:
org/apache/hadoop/fs/FileContextCreateMkdirBaseTest

Stack Trace:
java.lang.NoClassDefFoundError: org/apache/hadoop/fs/FileContextCreateMkdirBaseTest
	at java.lang.ClassLoader.defineClass1(Native Method)
	at java.lang.ClassLoader.defineClass(ClassLoader.java:621)
	at java.security.SecureClassLoader.defineClass(SecureClassLoader.java:124)
	at java.net.URLClassLoader.defineClass(URLClassLoader.java:260)
	at java.net.URLClassLoader.access$000(URLClassLoader.java:56)
	at java.net.URLClassLoader$1.run(URLClassLoader.java:195)
	at java.security.AccessController.doPrivileged(Native Method)
	at java.net.URLClassLoader.findClass(URLClassLoader.java:188)
	at java.lang.ClassLoader.loadClass(ClassLoader.java:307)
	at sun.misc.Launcher$AppClassLoader.loadClass(Launcher.java:301)
	at java.lang.ClassLoader.loadClass(ClassLoader.java:252)
	at java.lang.ClassLoader.loadClassInternal(ClassLoader.java:320)
	at java.lang.Class.forName0(Native Method)
	at java.lang.Class.forName(Class.java:169)
Caused by: java.lang.ClassNotFoundException: org.apache.hadoop.fs.FileContextCreateMkdirBaseTest
	at java.net.URLClassLoader$1.run(URLClassLoader.java:200)
	at java.security.AccessController.doPrivileged(Native Method)
	at java.net.URLClassLoader.findClass(URLClassLoader.java:188)
	at java.lang.ClassLoader.loadClass(ClassLoader.java:307)
	at sun.misc.Launcher$AppClassLoader.loadClass(Launcher.java:301)
	at java.lang.ClassLoader.loadClass(ClassLoader.java:252)
	at java.lang.ClassLoader.loadClassInternal(ClassLoader.java:320)


FAILED:  <init>.org.apache.hadoop.fs.TestFcHdfsPermission

Error Message:
org/apache/hadoop/fs/FileContextPermissionBase

Stack Trace:
java.lang.NoClassDefFoundError: org/apache/hadoop/fs/FileContextPermissionBase
	at java.lang.ClassLoader.defineClass1(Native Method)
	at java.lang.ClassLoader.defineClass(ClassLoader.java:621)
	at java.security.SecureClassLoader.defineClass(SecureClassLoader.java:124)
	at java.net.URLClassLoader.defineClass(URLClassLoader.java:260)
	at java.net.URLClassLoader.access$000(URLClassLoader.java:56)
	at java.net.URLClassLoader$1.run(URLClassLoader.java:195)
	at java.security.AccessController.doPrivileged(Native Method)
	at java.net.URLClassLoader.findClass(URLClassLoader.java:188)
	at java.lang.ClassLoader.loadClass(ClassLoader.java:307)
	at sun.misc.Launcher$AppClassLoader.loadClass(Launcher.java:301)
	at java.lang.ClassLoader.loadClass(ClassLoader.java:252)
	at java.lang.ClassLoader.loadClassInternal(ClassLoader.java:320)
	at java.lang.Class.forName0(Native Method)
	at java.lang.Class.forName(Class.java:169)
Caused by: java.lang.ClassNotFoundException: org.apache.hadoop.fs.FileContextPermissionBase
	at java.net.URLClassLoader$1.run(URLClassLoader.java:200)
	at java.security.AccessController.doPrivileged(Native Method)
	at java.net.URLClassLoader.findClass(URLClassLoader.java:188)
	at java.lang.ClassLoader.loadClass(ClassLoader.java:307)
	at sun.misc.Launcher$AppClassLoader.loadClass(Launcher.java:301)
	at java.lang.ClassLoader.loadClass(ClassLoader.java:252)
	at java.lang.ClassLoader.loadClassInternal(ClassLoader.java:320)


FAILED:  <init>.org.apache.hadoop.fs.TestFcHdfsSymlink

Error Message:
org/apache/hadoop/fs/FileContextSymlinkBaseTest

Stack Trace:
java.lang.NoClassDefFoundError: org/apache/hadoop/fs/FileContextSymlinkBaseTest
	at java.lang.ClassLoader.defineClass1(Native Method)
	at java.lang.ClassLoader.defineClass(ClassLoader.java:621)
	at java.security.SecureClassLoader.defineClass(SecureClassLoader.java:124)
	at java.net.URLClassLoader.defineClass(URLClassLoader.java:260)
	at java.net.URLClassLoader.access$000(URLClassLoader.java:56)
	at java.net.URLClassLoader$1.run(URLClassLoader.java:195)
	at java.security.AccessController.doPrivileged(Native Method)
	at java.net.URLClassLoader.findClass(URLClassLoader.java:188)
	at java.lang.ClassLoader.loadClass(ClassLoader.java:307)
	at sun.misc.Launcher$AppClassLoader.loadClass(Launcher.java:301)
	at java.lang.ClassLoader.loadClass(ClassLoader.java:252)
	at java.lang.ClassLoader.loadClassInternal(ClassLoader.java:320)
	at java.lang.Class.forName0(Native Method)
	at java.lang.Class.forName(Class.java:169)
Caused by: java.lang.ClassNotFoundException: org.apache.hadoop.fs.FileContextSymlinkBaseTest
	at java.net.URLClassLoader$1.run(URLClassLoader.java:200)
	at java.security.AccessController.doPrivileged(Native Method)
	at java.net.URLClassLoader.findClass(URLClassLoader.java:188)
	at java.lang.ClassLoader.loadClass(ClassLoader.java:307)
	at sun.misc.Launcher$AppClassLoader.loadClass(Launcher.java:301)
	at java.lang.ClassLoader.loadClass(ClassLoader.java:252)
	at java.lang.ClassLoader.loadClassInternal(ClassLoader.java:320)


FAILED:  <init>.org.apache.hadoop.fs.TestGlobPaths

Error Message:
org/apache/hadoop/conf/Configuration

Stack Trace:
java.lang.NoClassDefFoundError: org/apache/hadoop/conf/Configuration
	at java.lang.Class.forName0(Native Method)
	at java.lang.Class.forName(Class.java:169)
Caused by: java.lang.ClassNotFoundException: org.apache.hadoop.conf.Configuration
	at java.net.URLClassLoader$1.run(URLClassLoader.java:200)
	at java.security.AccessController.doPrivileged(Native Method)
	at java.net.URLClassLoader.findClass(URLClassLoader.java:188)
	at java.lang.ClassLoader.loadClass(ClassLoader.java:307)
	at sun.misc.Launcher$AppClassLoader.loadClass(Launcher.java:301)
	at java.lang.ClassLoader.loadClass(ClassLoader.java:252)
	at java.lang.ClassLoader.loadClassInternal(ClassLoader.java:320)


FAILED:  <init>.org.apache.hadoop.fs.TestHDFSFileContextMainOperations

Error Message:
org/apache/hadoop/fs/FileContextMainOperationsBaseTest

Stack Trace:
java.lang.NoClassDefFoundError: org/apache/hadoop/fs/FileContextMainOperationsBaseTest
	at java.lang.ClassLoader.defineClass1(Native Method)
	at java.lang.ClassLoader.defineClass(ClassLoader.java:621)
	at java.security.SecureClassLoader.defineClass(SecureClassLoader.java:124)
	at java.net.URLClassLoader.defineClass(URLClassLoader.java:260)
	at java.net.URLClassLoader.access$000(URLClassLoader.java:56)
	at java.net.URLClassLoader$1.run(URLClassLoader.java:195)
	at java.security.AccessController.doPrivileged(Native Method)
	at java.net.URLClassLoader.findClass(URLClassLoader.java:188)
	at java.lang.ClassLoader.loadClass(ClassLoader.java:307)
	at sun.misc.Launcher$AppClassLoader.loadClass(Launcher.java:301)
	at java.lang.ClassLoader.loadClass(ClassLoader.java:252)
	at java.lang.ClassLoader.loadClassInternal(ClassLoader.java:320)
	at java.lang.Class.forName0(Native Method)
	at java.lang.Class.forName(Class.java:169)
Caused by: java.lang.ClassNotFoundException: org.apache.hadoop.fs.FileContextMainOperationsBaseTest
	at java.net.URLClassLoader$1.run(URLClassLoader.java:200)
	at java.security.AccessController.doPrivileged(Native Method)
	at java.net.URLClassLoader.findClass(URLClassLoader.java:188)
	at java.lang.ClassLoader.loadClass(ClassLoader.java:307)
	at sun.misc.Launcher$AppClassLoader.loadClass(Launcher.java:301)
	at java.lang.ClassLoader.loadClass(ClassLoader.java:252)
	at java.lang.ClassLoader.loadClassInternal(ClassLoader.java:320)


FAILED:  <init>.org.apache.hadoop.fs.loadGenerator.TestLoadGenerator

Error Message:
org/apache/hadoop/util/Tool

Stack Trace:
java.lang.NoClassDefFoundError: org/apache/hadoop/util/Tool
	at java.lang.ClassLoader.defineClass1(Native Method)
	at java.lang.ClassLoader.defineClass(ClassLoader.java:621)
	at java.security.SecureClassLoader.defineClass(SecureClassLoader.java:124)
	at java.net.URLClassLoader.defineClass(URLClassLoader.java:260)
	at java.net.URLClassLoader.access$000(URLClassLoader.java:56)
	at java.net.URLClassLoader$1.run(URLClassLoader.java:195)
	at java.security.AccessController.doPrivileged(Native Method)
	at java.net.URLClassLoader.findClass(URLClassLoader.java:188)
	at java.lang.ClassLoader.loadClass(ClassLoader.java:307)
	at sun.misc.Launcher$AppClassLoader.loadClass(Launcher.java:301)
	at java.lang.ClassLoader.loadClass(ClassLoader.java:252)
	at java.lang.ClassLoader.loadClassInternal(ClassLoader.java:320)
	at java.lang.Class.forName0(Native Method)
	at java.lang.Class.forName(Class.java:169)
Caused by: java.lang.ClassNotFoundException: org.apache.hadoop.util.Tool
	at java.net.URLClassLoader$1.run(URLClassLoader.java:200)
	at java.security.AccessController.doPrivileged(Native Method)
	at java.net.URLClassLoader.findClass(URLClassLoader.java:188)
	at java.lang.ClassLoader.loadClass(ClassLoader.java:307)
	at sun.misc.Launcher$AppClassLoader.loadClass(Launcher.java:301)
	at java.lang.ClassLoader.loadClass(ClassLoader.java:252)
	at java.lang.ClassLoader.loadClassInternal(ClassLoader.java:320)


FAILED:  <init>.org.apache.hadoop.fs.permission.TestStickyBit

Error Message:
org/apache/hadoop/conf/Configuration

Stack Trace:
java.lang.NoClassDefFoundError: org/apache/hadoop/conf/Configuration
	at java.lang.Class.forName0(Native Method)
	at java.lang.Class.forName(Class.java:169)
Caused by: java.lang.ClassNotFoundException: org.apache.hadoop.conf.Configuration
	at java.net.URLClassLoader$1.run(URLClassLoader.java:200)
	at java.security.AccessController.doPrivileged(Native Method)
	at java.net.URLClassLoader.findClass(URLClassLoader.java:188)
	at java.lang.ClassLoader.loadClass(ClassLoader.java:307)
	at sun.misc.Launcher$AppClassLoader.loadClass(Launcher.java:301)
	at java.lang.ClassLoader.loadClass(ClassLoader.java:252)
	at java.lang.ClassLoader.loadClassInternal(ClassLoader.java:320)


FAILED:  <init>.org.apache.hadoop.hdfs.TestBlockMissingException

Error Message:
org/apache/hadoop/conf/Configuration

Stack Trace:
java.lang.NoClassDefFoundError: org/apache/hadoop/conf/Configuration
	at java.lang.Class.forName0(Native Method)
	at java.lang.Class.forName(Class.java:169)
Caused by: java.lang.ClassNotFoundException: org.apache.hadoop.conf.Configuration
	at java.net.URLClassLoader$1.run(URLClassLoader.java:200)
	at java.security.AccessController.doPrivileged(Native Method)
	at java.net.URLClassLoader.findClass(URLClassLoader.java:188)
	at java.lang.ClassLoader.loadClass(ClassLoader.java:307)
	at sun.misc.Launcher$AppClassLoader.loadClass(Launcher.java:301)
	at java.lang.ClassLoader.loadClass(ClassLoader.java:252)
	at java.lang.ClassLoader.loadClassInternal(ClassLoader.java:320)


REGRESSION:  org.apache.hadoop.hdfs.TestByteRangeInputStream.testByteRange

Error Message:
org/apache/hadoop/fs/FSInputStream

Stack Trace:
java.lang.NoClassDefFoundError: org/apache/hadoop/fs/FSInputStream
	at java.lang.ClassLoader.defineClass1(Native Method)
	at java.lang.ClassLoader.defineClass(ClassLoader.java:621)
	at java.security.SecureClassLoader.defineClass(SecureClassLoader.java:124)
	at java.net.URLClassLoader.defineClass(URLClassLoader.java:260)
	at java.net.URLClassLoader.access$000(URLClassLoader.java:56)
	at java.net.URLClassLoader$1.run(URLClassLoader.java:195)
	at java.security.AccessController.doPrivileged(Native Method)
	at java.net.URLClassLoader.findClass(URLClassLoader.java:188)
	at java.lang.ClassLoader.loadClass(ClassLoader.java:307)
	at sun.misc.Launcher$AppClassLoader.loadClass(Launcher.java:301)
	at java.lang.ClassLoader.loadClass(ClassLoader.java:252)
	at java.lang.ClassLoader.loadClassInternal(ClassLoader.java:320)
	at org.apache.hadoop.hdfs.TestByteRangeInputStream.testByteRange(TestByteRangeInputStream.java:114)
Caused by: java.lang.ClassNotFoundException: org.apache.hadoop.fs.FSInputStream
	at java.net.URLClassLoader$1.run(URLClassLoader.java:200)
	at java.security.AccessController.doPrivileged(Native Method)
	at java.net.URLClassLoader.findClass(URLClassLoader.java:188)
	at java.lang.ClassLoader.loadClass(ClassLoader.java:307)
	at sun.misc.Launcher$AppClassLoader.loadClass(Launcher.java:301)
	at java.lang.ClassLoader.loadClass(ClassLoader.java:252)
	at java.lang.ClassLoader.loadClassInternal(ClassLoader.java:320)


FAILED:  <init>.org.apache.hadoop.hdfs.TestClientBlockVerification

Error Message:
org/apache/hadoop/conf/Configuration

Stack Trace:
java.lang.NoClassDefFoundError: org/apache/hadoop/conf/Configuration
	at java.lang.Class.forName0(Native Method)
	at java.lang.Class.forName(Class.java:169)
Caused by: java.lang.ClassNotFoundException: org.apache.hadoop.conf.Configuration
	at java.net.URLClassLoader$1.run(URLClassLoader.java:200)
	at java.security.AccessController.doPrivileged(Native Method)
	at java.net.URLClassLoader.findClass(URLClassLoader.java:188)
	at java.lang.ClassLoader.loadClass(ClassLoader.java:307)
	at sun.misc.Launcher$AppClassLoader.loadClass(Launcher.java:301)
	at java.lang.ClassLoader.loadClass(ClassLoader.java:252)
	at java.lang.ClassLoader.loadClassInternal(ClassLoader.java:320)


FAILED:  <init>.org.apache.hadoop.hdfs.TestClientProtocolForPipelineRecovery

Error Message:
org/apache/hadoop/conf/Configuration

Stack Trace:
java.lang.NoClassDefFoundError: org/apache/hadoop/conf/Configuration
	at java.lang.Class.forName0(Native Method)
	at java.lang.Class.forName(Class.java:169)
Caused by: java.lang.ClassNotFoundException: org.apache.hadoop.conf.Configuration
	at java.net.URLClassLoader$1.run(URLClassLoader.java:200)
	at java.security.AccessController.doPrivileged(Native Method)
	at java.net.URLClassLoader.findClass(URLClassLoader.java:188)
	at java.lang.ClassLoader.loadClass(ClassLoader.java:307)
	at sun.misc.Launcher$AppClassLoader.loadClass(Launcher.java:301)
	at java.lang.ClassLoader.loadClass(ClassLoader.java:252)
	at java.lang.ClassLoader.loadClassInternal(ClassLoader.java:320)


FAILED:  <init>.org.apache.hadoop.hdfs.TestCrcCorruption

Error Message:
org/apache/hadoop/conf/Configuration

Stack Trace:
java.lang.NoClassDefFoundError: org/apache/hadoop/conf/Configuration
	at java.lang.Class.forName0(Native Method)
	at java.lang.Class.forName(Class.java:169)
Caused by: java.lang.ClassNotFoundException: org.apache.hadoop.conf.Configuration
	at java.net.URLClassLoader$1.run(URLClassLoader.java:200)
	at java.security.AccessController.doPrivileged(Native Method)
	at java.net.URLClassLoader.findClass(URLClassLoader.java:188)
	at java.lang.ClassLoader.loadClass(ClassLoader.java:307)
	at sun.misc.Launcher$AppClassLoader.loadClass(Launcher.java:301)
	at java.lang.ClassLoader.loadClass(ClassLoader.java:252)
	at java.lang.ClassLoader.loadClassInternal(ClassLoader.java:320)


FAILED:  <init>.org.apache.hadoop.hdfs.TestDFSClientExcludedNodes

Error Message:
org/apache/hadoop/conf/Configuration

Stack Trace:
java.lang.NoClassDefFoundError: org/apache/hadoop/conf/Configuration
	at java.lang.Class.forName0(Native Method)
	at java.lang.Class.forName(Class.java:169)
Caused by: java.lang.ClassNotFoundException: org.apache.hadoop.conf.Configuration
	at java.net.URLClassLoader$1.run(URLClassLoader.java:200)
	at java.security.AccessController.doPrivileged(Native Method)
	at java.net.URLClassLoader.findClass(URLClassLoader.java:188)
	at java.lang.ClassLoader.loadClass(ClassLoader.java:307)
	at sun.misc.Launcher$AppClassLoader.loadClass(Launcher.java:301)
	at java.lang.ClassLoader.loadClass(ClassLoader.java:252)
	at java.lang.ClassLoader.loadClassInternal(ClassLoader.java:320)


FAILED:  <init>.org.apache.hadoop.hdfs.TestDFSClientRetries

Error Message:
org/apache/hadoop/conf/Configuration

Stack Trace:
java.lang.NoClassDefFoundError: org/apache/hadoop/conf/Configuration
	at java.lang.Class.forName0(Native Method)
	at java.lang.Class.forName(Class.java:169)
Caused by: java.lang.ClassNotFoundException: org.apache.hadoop.conf.Configuration
	at java.net.URLClassLoader$1.run(URLClassLoader.java:200)
	at java.security.AccessController.doPrivileged(Native Method)
	at java.net.URLClassLoader.findClass(URLClassLoader.java:188)
	at java.lang.ClassLoader.loadClass(ClassLoader.java:307)
	at sun.misc.Launcher$AppClassLoader.loadClass(Launcher.java:301)
	at java.lang.ClassLoader.loadClass(ClassLoader.java:252)
	at java.lang.ClassLoader.loadClassInternal(ClassLoader.java:320)


FAILED:  <init>.org.apache.hadoop.hdfs.TestDFSFinalize

Error Message:
org/apache/hadoop/conf/Configuration

Stack Trace:
java.lang.NoClassDefFoundError: org/apache/hadoop/conf/Configuration
	at java.lang.Class.forName0(Native Method)
	at java.lang.Class.forName(Class.java:169)
Caused by: java.lang.ClassNotFoundException: org.apache.hadoop.conf.Configuration
	at java.net.URLClassLoader$1.run(URLClassLoader.java:200)
	at java.security.AccessController.doPrivileged(Native Method)
	at java.net.URLClassLoader.findClass(URLClassLoader.java:188)
	at java.lang.ClassLoader.loadClass(ClassLoader.java:307)
	at sun.misc.Launcher$AppClassLoader.loadClass(Launcher.java:301)
	at java.lang.ClassLoader.loadClass(ClassLoader.java:252)
	at java.lang.ClassLoader.loadClassInternal(ClassLoader.java:320)


FAILED:  <init>.org.apache.hadoop.hdfs.TestDFSMkdirs

Error Message:
org/apache/hadoop/fs/FSDataOutputStream

Stack Trace:
java.lang.NoClassDefFoundError: org/apache/hadoop/fs/FSDataOutputStream
	at java.lang.Class.forName0(Native Method)
	at java.lang.Class.forName(Class.java:169)
Caused by: java.lang.ClassNotFoundException: org.apache.hadoop.fs.FSDataOutputStream
	at java.net.URLClassLoader$1.run(URLClassLoader.java:200)
	at java.security.AccessController.doPrivileged(Native Method)
	at java.net.URLClassLoader.findClass(URLClassLoader.java:188)
	at java.lang.ClassLoader.loadClass(ClassLoader.java:307)
	at sun.misc.Launcher$AppClassLoader.loadClass(Launcher.java:301)
	at java.lang.ClassLoader.loadClass(ClassLoader.java:252)
	at java.lang.ClassLoader.loadClassInternal(ClassLoader.java:320)


FAILED:  <init>.org.apache.hadoop.hdfs.TestDFSPermission

Error Message:
org/apache/hadoop/conf/Configuration

Stack Trace:
java.lang.NoClassDefFoundError: org/apache/hadoop/conf/Configuration
	at java.lang.Class.forName0(Native Method)
	at java.lang.Class.forName(Class.java:169)
Caused by: java.lang.ClassNotFoundException: org.apache.hadoop.conf.Configuration
	at java.net.URLClassLoader$1.run(URLClassLoader.java:200)
	at java.security.AccessController.doPrivileged(Native Method)
	at java.net.URLClassLoader.findClass(URLClassLoader.java:188)
	at java.lang.ClassLoader.loadClass(ClassLoader.java:307)
	at sun.misc.Launcher$AppClassLoader.loadClass(Launcher.java:301)
	at java.lang.ClassLoader.loadClass(ClassLoader.java:252)
	at java.lang.ClassLoader.loadClassInternal(ClassLoader.java:320)


FAILED:  <init>.org.apache.hadoop.hdfs.TestDFSRemove

Error Message:
org/apache/hadoop/fs/FSDataOutputStream

Stack Trace:
java.lang.NoClassDefFoundError: org/apache/hadoop/fs/FSDataOutputStream
	at java.lang.Class.forName0(Native Method)
	at java.lang.Class.forName(Class.java:169)
Caused by: java.lang.ClassNotFoundException: org.apache.hadoop.fs.FSDataOutputStream
	at java.net.URLClassLoader$1.run(URLClassLoader.java:200)
	at java.security.AccessController.doPrivileged(Native Method)
	at java.net.URLClassLoader.findClass(URLClassLoader.java:188)
	at java.lang.ClassLoader.loadClass(ClassLoader.java:307)
	at sun.misc.Launcher$AppClassLoader.loadClass(Launcher.java:301)
	at java.lang.ClassLoader.loadClass(ClassLoader.java:252)
	at java.lang.ClassLoader.loadClassInternal(ClassLoader.java:320)


FAILED:  <init>.org.apache.hadoop.hdfs.TestDFSRename

Error Message:
org/apache/hadoop/fs/FSDataOutputStream

Stack Trace:
java.lang.NoClassDefFoundError: org/apache/hadoop/fs/FSDataOutputStream
	at java.lang.Class.forName0(Native Method)
	at java.lang.Class.forName(Class.java:169)
Caused by: java.lang.ClassNotFoundException: org.apache.hadoop.fs.FSDataOutputStream
	at java.net.URLClassLoader$1.run(URLClassLoader.java:200)
	at java.security.AccessController.doPrivileged(Native Method)
	at java.net.URLClassLoader.findClass(URLClassLoader.java:188)
	at java.lang.ClassLoader.loadClass(ClassLoader.java:307)
	at sun.misc.Launcher$AppClassLoader.loadClass(Launcher.java:301)
	at java.lang.ClassLoader.loadClass(ClassLoader.java:252)
	at java.lang.ClassLoader.loadClassInternal(ClassLoader.java:320)


FAILED:  <init>.org.apache.hadoop.hdfs.TestDFSRollback

Error Message:
org/apache/hadoop/conf/Configuration

Stack Trace:
java.lang.NoClassDefFoundError: org/apache/hadoop/conf/Configuration
	at java.lang.Class.forName0(Native Method)
	at java.lang.Class.forName(Class.java:169)
Caused by: java.lang.ClassNotFoundException: org.apache.hadoop.conf.Configuration
	at java.net.URLClassLoader$1.run(URLClassLoader.java:200)
	at java.security.AccessController.doPrivileged(Native Method)
	at java.net.URLClassLoader.findClass(URLClassLoader.java:188)
	at java.lang.ClassLoader.loadClass(ClassLoader.java:307)
	at sun.misc.Launcher$AppClassLoader.loadClass(Launcher.java:301)
	at java.lang.ClassLoader.loadClass(ClassLoader.java:252)
	at java.lang.ClassLoader.loadClassInternal(ClassLoader.java:320)


FAILED:  <init>.org.apache.hadoop.hdfs.TestDFSStartupVersions

Error Message:
org/apache/hadoop/conf/Configuration

Stack Trace:
java.lang.NoClassDefFoundError: org/apache/hadoop/conf/Configuration
	at java.lang.Class.forName0(Native Method)
	at java.lang.Class.forName(Class.java:169)
Caused by: java.lang.ClassNotFoundException: org.apache.hadoop.conf.Configuration
	at java.net.URLClassLoader$1.run(URLClassLoader.java:200)
	at java.security.AccessController.doPrivileged(Native Method)
	at java.net.URLClassLoader.findClass(URLClassLoader.java:188)
	at java.lang.ClassLoader.loadClass(ClassLoader.java:307)
	at sun.misc.Launcher$AppClassLoader.loadClass(Launcher.java:301)
	at java.lang.ClassLoader.loadClass(ClassLoader.java:252)
	at java.lang.ClassLoader.loadClassInternal(ClassLoader.java:320)


FAILED:  <init>.org.apache.hadoop.hdfs.TestDFSStorageStateRecovery

Error Message:
org/apache/hadoop/conf/Configuration

Stack Trace:
java.lang.NoClassDefFoundError: org/apache/hadoop/conf/Configuration
	at java.lang.Class.forName0(Native Method)
	at java.lang.Class.forName(Class.java:169)
Caused by: java.lang.ClassNotFoundException: org.apache.hadoop.conf.Configuration
	at java.net.URLClassLoader$1.run(URLClassLoader.java:200)
	at java.security.AccessController.doPrivileged(Native Method)
	at java.net.URLClassLoader.findClass(URLClassLoader.java:188)
	at java.lang.ClassLoader.loadClass(ClassLoader.java:307)
	at sun.misc.Launcher$AppClassLoader.loadClass(Launcher.java:301)
	at java.lang.ClassLoader.loadClass(ClassLoader.java:252)
	at java.lang.ClassLoader.loadClassInternal(ClassLoader.java:320)


FAILED:  <init>.org.apache.hadoop.hdfs.TestDFSUpgrade

Error Message:
org/apache/hadoop/conf/Configuration

Stack Trace:
java.lang.NoClassDefFoundError: org/apache/hadoop/conf/Configuration
	at java.lang.Class.forName0(Native Method)
	at java.lang.Class.forName(Class.java:169)
Caused by: java.lang.ClassNotFoundException: org.apache.hadoop.conf.Configuration
	at java.net.URLClassLoader$1.run(URLClassLoader.java:200)
	at java.security.AccessController.doPrivileged(Native Method)
	at java.net.URLClassLoader.findClass(URLClassLoader.java:188)
	at java.lang.ClassLoader.loadClass(ClassLoader.java:307)
	at sun.misc.Launcher$AppClassLoader.loadClass(Launcher.java:301)
	at java.lang.ClassLoader.loadClass(ClassLoader.java:252)
	at java.lang.ClassLoader.loadClassInternal(ClassLoader.java:320)


FAILED:  <init>.org.apache.hadoop.hdfs.TestDatanodeBlockScanner

Error Message:
org/apache/hadoop/conf/Configuration

Stack Trace:
java.lang.NoClassDefFoundError: org/apache/hadoop/conf/Configuration
	at java.lang.Class.forName0(Native Method)
	at java.lang.Class.forName(Class.java:169)
Caused by: java.lang.ClassNotFoundException: org.apache.hadoop.conf.Configuration
	at java.net.URLClassLoader$1.run(URLClassLoader.java:200)
	at java.security.AccessController.doPrivileged(Native Method)
	at java.net.URLClassLoader.findClass(URLClassLoader.java:188)
	at java.lang.ClassLoader.loadClass(ClassLoader.java:307)
	at sun.misc.Launcher$AppClassLoader.loadClass(Launcher.java:301)
	at java.lang.ClassLoader.loadClass(ClassLoader.java:252)
	at java.lang.ClassLoader.loadClassInternal(ClassLoader.java:320)


FAILED:  <init>.org.apache.hadoop.hdfs.TestDatanodeConfig

Error Message:
org/apache/hadoop/conf/Configuration

Stack Trace:
java.lang.NoClassDefFoundError: org/apache/hadoop/conf/Configuration
	at java.lang.Class.forName0(Native Method)
	at java.lang.Class.forName(Class.java:169)
Caused by: java.lang.ClassNotFoundException: org.apache.hadoop.conf.Configuration
	at java.net.URLClassLoader$1.run(URLClassLoader.java:200)
	at java.security.AccessController.doPrivileged(Native Method)
	at java.net.URLClassLoader.findClass(URLClassLoader.java:188)
	at java.lang.ClassLoader.loadClass(ClassLoader.java:307)
	at sun.misc.Launcher$AppClassLoader.loadClass(Launcher.java:301)
	at java.lang.ClassLoader.loadClass(ClassLoader.java:252)
	at java.lang.ClassLoader.loadClassInternal(ClassLoader.java:320)


FAILED:  <init>.org.apache.hadoop.hdfs.TestDatanodeDeath

Error Message:
org/apache/hadoop/conf/Configuration

Stack Trace:
java.lang.NoClassDefFoundError: org/apache/hadoop/conf/Configuration
	at java.lang.Class.forName0(Native Method)
	at java.lang.Class.forName(Class.java:169)
Caused by: java.lang.ClassNotFoundException: org.apache.hadoop.conf.Configuration
	at java.net.URLClassLoader$1.run(URLClassLoader.java:200)
	at java.security.AccessController.doPrivileged(Native Method)
	at java.net.URLClassLoader.findClass(URLClassLoader.java:188)
	at java.lang.ClassLoader.loadClass(ClassLoader.java:307)
	at sun.misc.Launcher$AppClassLoader.loadClass(Launcher.java:301)
	at java.lang.ClassLoader.loadClass(ClassLoader.java:252)
	at java.lang.ClassLoader.loadClassInternal(ClassLoader.java:320)


FAILED:  <init>.org.apache.hadoop.hdfs.TestDatanodeRegistration

Error Message:
org/apache/hadoop/conf/Configuration

Stack Trace:
java.lang.NoClassDefFoundError: org/apache/hadoop/conf/Configuration
	at java.lang.Class.forName0(Native Method)
	at java.lang.Class.forName(Class.java:169)
Caused by: java.lang.ClassNotFoundException: org.apache.hadoop.conf.Configuration
	at java.net.URLClassLoader$1.run(URLClassLoader.java:200)
	at java.security.AccessController.doPrivileged(Native Method)
	at java.net.URLClassLoader.findClass(URLClassLoader.java:188)
	at java.lang.ClassLoader.loadClass(ClassLoader.java:307)
	at sun.misc.Launcher$AppClassLoader.loadClass(Launcher.java:301)
	at java.lang.ClassLoader.loadClass(ClassLoader.java:252)
	at java.lang.ClassLoader.loadClassInternal(ClassLoader.java:320)


FAILED:  <init>.org.apache.hadoop.hdfs.TestDecommission

Error Message:
org/apache/hadoop/conf/Configuration

Stack Trace:
java.lang.NoClassDefFoundError: org/apache/hadoop/conf/Configuration
	at java.lang.Class.forName0(Native Method)
	at java.lang.Class.forName(Class.java:169)
Caused by: java.lang.ClassNotFoundException: org.apache.hadoop.conf.Configuration
	at java.net.URLClassLoader$1.run(URLClassLoader.java:200)
	at java.security.AccessController.doPrivileged(Native Method)
	at java.net.URLClassLoader.findClass(URLClassLoader.java:188)
	at java.lang.ClassLoader.loadClass(ClassLoader.java:307)
	at sun.misc.Launcher$AppClassLoader.loadClass(Launcher.java:301)
	at java.lang.ClassLoader.loadClass(ClassLoader.java:252)
	at java.lang.ClassLoader.loadClassInternal(ClassLoader.java:320)


FAILED:  <init>.org.apache.hadoop.hdfs.TestDeprecatedKeys

Error Message:
org/apache/hadoop/conf/Configuration

Stack Trace:
java.lang.NoClassDefFoundError: org/apache/hadoop/conf/Configuration
	at java.lang.Class.forName0(Native Method)
	at java.lang.Class.forName(Class.java:169)
Caused by: java.lang.ClassNotFoundException: org.apache.hadoop.conf.Configuration
	at java.net.URLClassLoader$1.run(URLClassLoader.java:200)
	at java.security.AccessController.doPrivileged(Native Method)
	at java.net.URLClassLoader.findClass(URLClassLoader.java:188)
	at java.lang.ClassLoader.loadClass(ClassLoader.java:307)
	at sun.misc.Launcher$AppClassLoader.loadClass(Launcher.java:301)
	at java.lang.ClassLoader.loadClass(ClassLoader.java:252)
	at java.lang.ClassLoader.loadClassInternal(ClassLoader.java:320)


FAILED:  <init>.org.apache.hadoop.hdfs.TestDfsOverAvroRpc

Error Message:
org/apache/hadoop/conf/Configuration

Stack Trace:
java.lang.NoClassDefFoundError: org/apache/hadoop/conf/Configuration
	at java.lang.Class.forName0(Native Method)
	at java.lang.Class.forName(Class.java:169)
Caused by: java.lang.ClassNotFoundException: org.apache.hadoop.conf.Configuration
	at java.net.URLClassLoader$1.run(URLClassLoader.java:200)
	at java.security.AccessController.doPrivileged(Native Method)
	at java.net.URLClassLoader.findClass(URLClassLoader.java:188)
	at java.lang.ClassLoader.loadClass(ClassLoader.java:307)
	at sun.misc.Launcher$AppClassLoader.loadClass(Launcher.java:301)
	at java.lang.ClassLoader.loadClass(ClassLoader.java:252)
	at java.lang.ClassLoader.loadClassInternal(ClassLoader.java:320)


FAILED:  <init>.org.apache.hadoop.hdfs.TestFileConcurrentReader

Error Message:
org/apache/hadoop/fs/FSDataInputStream

Stack Trace:
java.lang.NoClassDefFoundError: org/apache/hadoop/fs/FSDataInputStream
	at java.lang.Class.forName0(Native Method)
	at java.lang.Class.forName(Class.java:169)
Caused by: java.lang.ClassNotFoundException: org.apache.hadoop.fs.FSDataInputStream
	at java.net.URLClassLoader$1.run(URLClassLoader.java:200)
	at java.security.AccessController.doPrivileged(Native Method)
	at java.net.URLClassLoader.findClass(URLClassLoader.java:188)
	at java.lang.ClassLoader.loadClass(ClassLoader.java:307)
	at sun.misc.Launcher$AppClassLoader.loadClass(Launcher.java:301)
	at java.lang.ClassLoader.loadClass(ClassLoader.java:252)
	at java.lang.ClassLoader.loadClassInternal(ClassLoader.java:320)


FAILED:  <init>.org.apache.hadoop.hdfs.TestFileCreation

Error Message:
org/apache/hadoop/conf/Configuration

Stack Trace:
java.lang.NoClassDefFoundError: org/apache/hadoop/conf/Configuration
	at java.lang.Class.forName0(Native Method)
	at java.lang.Class.forName(Class.java:169)
Caused by: java.lang.ClassNotFoundException: org.apache.hadoop.conf.Configuration
	at java.net.URLClassLoader$1.run(URLClassLoader.java:200)
	at java.security.AccessController.doPrivileged(Native Method)
	at java.net.URLClassLoader.findClass(URLClassLoader.java:188)
	at java.lang.ClassLoader.loadClass(ClassLoader.java:307)
	at sun.misc.Launcher$AppClassLoader.loadClass(Launcher.java:301)
	at java.lang.ClassLoader.loadClass(ClassLoader.java:252)
	at java.lang.ClassLoader.loadClassInternal(ClassLoader.java:320)


FAILED:  <init>.org.apache.hadoop.hdfs.TestFileCreationClient

Error Message:
org/apache/hadoop/conf/Configuration

Stack Trace:
java.lang.NoClassDefFoundError: org/apache/hadoop/conf/Configuration
	at java.lang.Class.forName0(Native Method)
	at java.lang.Class.forName(Class.java:169)
Caused by: java.lang.ClassNotFoundException: org.apache.hadoop.conf.Configuration
	at java.net.URLClassLoader$1.run(URLClassLoader.java:200)
	at java.security.AccessController.doPrivileged(Native Method)
	at java.net.URLClassLoader.findClass(URLClassLoader.java:188)
	at java.lang.ClassLoader.loadClass(ClassLoader.java:307)
	at sun.misc.Launcher$AppClassLoader.loadClass(Launcher.java:301)
	at java.lang.ClassLoader.loadClass(ClassLoader.java:252)
	at java.lang.ClassLoader.loadClassInternal(ClassLoader.java:320)


FAILED:  <init>.org.apache.hadoop.hdfs.TestFileCreationDelete

Error Message:
org/apache/hadoop/conf/Configuration

Stack Trace:
java.lang.NoClassDefFoundError: org/apache/hadoop/conf/Configuration
	at java.lang.Class.forName0(Native Method)
	at java.lang.Class.forName(Class.java:169)
Caused by: java.lang.ClassNotFoundException: org.apache.hadoop.conf.Configuration
	at java.net.URLClassLoader$1.run(URLClassLoader.java:200)
	at java.security.AccessController.doPrivileged(Native Method)
	at java.net.URLClassLoader.findClass(URLClassLoader.java:188)
	at java.lang.ClassLoader.loadClass(ClassLoader.java:307)
	at sun.misc.Launcher$AppClassLoader.loadClass(Launcher.java:301)
	at java.lang.ClassLoader.loadClass(ClassLoader.java:252)
	at java.lang.ClassLoader.loadClassInternal(ClassLoader.java:320)


FAILED:  <init>.org.apache.hadoop.hdfs.TestFileCreationEmpty

Error Message:
org/apache/hadoop/conf/Configuration

Stack Trace:
java.lang.NoClassDefFoundError: org/apache/hadoop/conf/Configuration
	at java.lang.Class.forName0(Native Method)
	at java.lang.Class.forName(Class.java:169)
Caused by: java.lang.ClassNotFoundException: org.apache.hadoop.conf.Configuration
	at java.net.URLClassLoader$1.run(URLClassLoader.java:200)
	at java.security.AccessController.doPrivileged(Native Method)
	at java.net.URLClassLoader.findClass(URLClassLoader.java:188)
	at java.lang.ClassLoader.loadClass(ClassLoader.java:307)
	at sun.misc.Launcher$AppClassLoader.loadClass(Launcher.java:301)
	at java.lang.ClassLoader.loadClass(ClassLoader.java:252)
	at java.lang.ClassLoader.loadClassInternal(ClassLoader.java:320)


REGRESSION:  org.apache.hadoop.hdfs.TestFileCreationNamenodeRestart.testFileCreationNamenodeRestart

Error Message:
org/apache/hadoop/conf/Configuration

Stack Trace:
java.lang.NoClassDefFoundError: org/apache/hadoop/conf/Configuration
	at org.apache.hadoop.hdfs.TestFileCreationNamenodeRestart.testFileCreationNamenodeRestart(TestFileCreationNamenodeRestart.java:22)
Caused by: java.lang.ClassNotFoundException: org.apache.hadoop.conf.Configuration
	at java.net.URLClassLoader$1.run(URLClassLoader.java:200)
	at java.security.AccessController.doPrivileged(Native Method)
	at java.net.URLClassLoader.findClass(URLClassLoader.java:188)
	at java.lang.ClassLoader.loadClass(ClassLoader.java:307)
	at sun.misc.Launcher$AppClassLoader.loadClass(Launcher.java:301)
	at java.lang.ClassLoader.loadClass(ClassLoader.java:252)
	at java.lang.ClassLoader.loadClassInternal(ClassLoader.java:320)


FAILED:  <init>.org.apache.hadoop.hdfs.TestHDFSFileSystemContract

Error Message:
org/apache/hadoop/fs/FileSystemContractBaseTest

Stack Trace:
java.lang.NoClassDefFoundError: org/apache/hadoop/fs/FileSystemContractBaseTest
	at java.lang.ClassLoader.defineClass1(Native Method)
	at java.lang.ClassLoader.defineClass(ClassLoader.java:621)
	at java.security.SecureClassLoader.defineClass(SecureClassLoader.java:124)
	at java.net.URLClassLoader.defineClass(URLClassLoader.java:260)
	at java.net.URLClassLoader.access$000(URLClassLoader.java:56)
	at java.net.URLClassLoader$1.run(URLClassLoader.java:195)
	at java.security.AccessController.doPrivileged(Native Method)
	at java.net.URLClassLoader.findClass(URLClassLoader.java:188)
	at java.lang.ClassLoader.loadClass(ClassLoader.java:307)
	at sun.misc.Launcher$AppClassLoader.loadClass(Launcher.java:301)
	at java.lang.ClassLoader.loadClass(ClassLoader.java:252)
	at java.lang.ClassLoader.loadClassInternal(ClassLoader.java:320)
	at java.lang.Class.forName0(Native Method)
	at java.lang.Class.forName(Class.java:169)
Caused by: java.lang.ClassNotFoundException: org.apache.hadoop.fs.FileSystemContractBaseTest
	at java.net.URLClassLoader$1.run(URLClassLoader.java:200)
	at java.security.AccessController.doPrivileged(Native Method)
	at java.net.URLClassLoader.findClass(URLClassLoader.java:188)
	at java.lang.ClassLoader.loadClass(ClassLoader.java:307)
	at sun.misc.Launcher$AppClassLoader.loadClass(Launcher.java:301)
	at java.lang.ClassLoader.loadClass(ClassLoader.java:252)
	at java.lang.ClassLoader.loadClassInternal(ClassLoader.java:320)


FAILED:  <init>.org.apache.hadoop.hdfs.TestHFlush

Error Message:
org/apache/hadoop/conf/Configuration

Stack Trace:
java.lang.NoClassDefFoundError: org/apache/hadoop/conf/Configuration
	at java.lang.Class.forName0(Native Method)
	at java.lang.Class.forName(Class.java:169)
Caused by: java.lang.ClassNotFoundException: org.apache.hadoop.conf.Configuration
	at java.net.URLClassLoader$1.run(URLClassLoader.java:200)
	at java.security.AccessController.doPrivileged(Native Method)
	at java.net.URLClassLoader.findClass(URLClassLoader.java:188)
	at java.lang.ClassLoader.loadClass(ClassLoader.java:307)
	at sun.misc.Launcher$AppClassLoader.loadClass(Launcher.java:301)
	at java.lang.ClassLoader.loadClass(ClassLoader.java:252)
	at java.lang.ClassLoader.loadClassInternal(ClassLoader.java:320)


FAILED:  <init>.org.apache.hadoop.hdfs.TestInjectionForSimulatedStorage

Error Message:
org/apache/hadoop/conf/Configuration

Stack Trace:
java.lang.NoClassDefFoundError: org/apache/hadoop/conf/Configuration
	at java.lang.Class.forName0(Native Method)
	at java.lang.Class.forName(Class.java:169)
Caused by: java.lang.ClassNotFoundException: org.apache.hadoop.conf.Configuration
	at java.net.URLClassLoader$1.run(URLClassLoader.java:200)
	at java.security.AccessController.doPrivileged(Native Method)
	at java.net.URLClassLoader.findClass(URLClassLoader.java:188)
	at java.lang.ClassLoader.loadClass(ClassLoader.java:307)
	at sun.misc.Launcher$AppClassLoader.loadClass(Launcher.java:301)
	at java.lang.ClassLoader.loadClass(ClassLoader.java:252)
	at java.lang.ClassLoader.loadClassInternal(ClassLoader.java:320)


FAILED:  <init>.org.apache.hadoop.hdfs.TestLeaseRecovery2

Error Message:
org/apache/hadoop/conf/Configuration

Stack Trace:
java.lang.NoClassDefFoundError: org/apache/hadoop/conf/Configuration
	at java.lang.Class.forName0(Native Method)
	at java.lang.Class.forName(Class.java:169)
Caused by: java.lang.ClassNotFoundException: org.apache.hadoop.conf.Configuration
	at java.net.URLClassLoader$1.run(URLClassLoader.java:200)
	at java.security.AccessController.doPrivileged(Native Method)
	at java.net.URLClassLoader.findClass(URLClassLoader.java:188)
	at java.lang.ClassLoader.loadClass(ClassLoader.java:307)
	at sun.misc.Launcher$AppClassLoader.loadClass(Launcher.java:301)
	at java.lang.ClassLoader.loadClass(ClassLoader.java:252)
	at java.lang.ClassLoader.loadClassInternal(ClassLoader.java:320)


FAILED:  <init>.org.apache.hadoop.hdfs.TestListPathServlet

Error Message:
org/apache/hadoop/conf/Configuration

Stack Trace:
java.lang.NoClassDefFoundError: org/apache/hadoop/conf/Configuration
	at java.lang.Class.forName0(Native Method)
	at java.lang.Class.forName(Class.java:169)
Caused by: java.lang.ClassNotFoundException: org.apache.hadoop.conf.Configuration
	at java.net.URLClassLoader$1.run(URLClassLoader.java:200)
	at java.security.AccessController.doPrivileged(Native Method)
	at java.net.URLClassLoader.findClass(URLClassLoader.java:188)
	at java.lang.ClassLoader.loadClass(ClassLoader.java:307)
	at sun.misc.Launcher$AppClassLoader.loadClass(Launcher.java:301)
	at java.lang.ClassLoader.loadClass(ClassLoader.java:252)
	at java.lang.ClassLoader.loadClassInternal(ClassLoader.java:320)


FAILED:  <init>.org.apache.hadoop.hdfs.TestModTime

Error Message:
org/apache/hadoop/conf/Configuration

Stack Trace:
java.lang.NoClassDefFoundError: org/apache/hadoop/conf/Configuration
	at java.lang.Class.forName0(Native Method)
	at java.lang.Class.forName(Class.java:169)
Caused by: java.lang.ClassNotFoundException: org.apache.hadoop.conf.Configuration
	at java.net.URLClassLoader$1.run(URLClassLoader.java:200)
	at java.security.AccessController.doPrivileged(Native Method)
	at java.net.URLClassLoader.findClass(URLClassLoader.java:188)
	at java.lang.ClassLoader.loadClass(ClassLoader.java:307)
	at sun.misc.Launcher$AppClassLoader.loadClass(Launcher.java:301)
	at java.lang.ClassLoader.loadClass(ClassLoader.java:252)
	at java.lang.ClassLoader.loadClassInternal(ClassLoader.java:320)


FAILED:  <init>.org.apache.hadoop.hdfs.TestPipelines

Error Message:
org/apache/hadoop/fs/FileSystem

Stack Trace:
java.lang.NoClassDefFoundError: org/apache/hadoop/fs/FileSystem
	at java.lang.Class.forName0(Native Method)
	at java.lang.Class.forName(Class.java:169)
Caused by: java.lang.ClassNotFoundException: org.apache.hadoop.fs.FileSystem
	at java.net.URLClassLoader$1.run(URLClassLoader.java:200)
	at java.security.AccessController.doPrivileged(Native Method)
	at java.net.URLClassLoader.findClass(URLClassLoader.java:188)
	at java.lang.ClassLoader.loadClass(ClassLoader.java:307)
	at sun.misc.Launcher$AppClassLoader.loadClass(Launcher.java:301)
	at java.lang.ClassLoader.loadClass(ClassLoader.java:252)
	at java.lang.ClassLoader.loadClassInternal(ClassLoader.java:320)


FAILED:  <init>.org.apache.hadoop.hdfs.TestReadWhileWriting

Error Message:
org/apache/hadoop/ipc/RemoteException

Stack Trace:
java.lang.NoClassDefFoundError: org/apache/hadoop/ipc/RemoteException
	at java.lang.Class.forName0(Native Method)
	at java.lang.Class.forName(Class.java:169)
Caused by: java.lang.ClassNotFoundException: org.apache.hadoop.ipc.RemoteException
	at java.net.URLClassLoader$1.run(URLClassLoader.java:200)
	at java.security.AccessController.doPrivileged(Native Method)
	at java.net.URLClassLoader.findClass(URLClassLoader.java:188)
	at java.lang.ClassLoader.loadClass(ClassLoader.java:307)
	at sun.misc.Launcher$AppClassLoader.loadClass(Launcher.java:301)
	at java.lang.ClassLoader.loadClass(ClassLoader.java:252)
	at java.lang.ClassLoader.loadClassInternal(ClassLoader.java:320)


FAILED:  <init>.org.apache.hadoop.hdfs.TestRenameWhileOpen

Error Message:
org/apache/hadoop/conf/Configuration

Stack Trace:
java.lang.NoClassDefFoundError: org/apache/hadoop/conf/Configuration
	at java.lang.Class.forName0(Native Method)
	at java.lang.Class.forName(Class.java:169)
Caused by: java.lang.ClassNotFoundException: org.apache.hadoop.conf.Configuration
	at java.net.URLClassLoader$1.run(URLClassLoader.java:200)
	at java.security.AccessController.doPrivileged(Native Method)
	at java.net.URLClassLoader.findClass(URLClassLoader.java:188)
	at java.lang.ClassLoader.loadClass(ClassLoader.java:307)
	at sun.misc.Launcher$AppClassLoader.loadClass(Launcher.java:301)
	at java.lang.ClassLoader.loadClass(ClassLoader.java:252)
	at java.lang.ClassLoader.loadClassInternal(ClassLoader.java:320)


FAILED:  <init>.org.apache.hadoop.hdfs.TestReplication

Error Message:
org/apache/hadoop/conf/Configuration

Stack Trace:
java.lang.NoClassDefFoundError: org/apache/hadoop/conf/Configuration
	at java.lang.Class.forName0(Native Method)
	at java.lang.Class.forName(Class.java:169)
Caused by: java.lang.ClassNotFoundException: org.apache.hadoop.conf.Configuration
	at java.net.URLClassLoader$1.run(URLClassLoader.java:200)
	at java.security.AccessController.doPrivileged(Native Method)
	at java.net.URLClassLoader.findClass(URLClassLoader.java:188)
	at java.lang.ClassLoader.loadClass(ClassLoader.java:307)
	at sun.misc.Launcher$AppClassLoader.loadClass(Launcher.java:301)
	at java.lang.ClassLoader.loadClass(ClassLoader.java:252)
	at java.lang.ClassLoader.loadClassInternal(ClassLoader.java:320)


FAILED:  <init>.org.apache.hadoop.hdfs.TestSeekBug

Error Message:
org/apache/hadoop/fs/FSDataOutputStream

Stack Trace:
java.lang.NoClassDefFoundError: org/apache/hadoop/fs/FSDataOutputStream
	at java.lang.Class.forName0(Native Method)
	at java.lang.Class.forName(Class.java:169)
Caused by: java.lang.ClassNotFoundException: org.apache.hadoop.fs.FSDataOutputStream
	at java.net.URLClassLoader$1.run(URLClassLoader.java:200)
	at java.security.AccessController.doPrivileged(Native Method)
	at java.net.URLClassLoader.findClass(URLClassLoader.java:188)
	at java.lang.ClassLoader.loadClass(ClassLoader.java:307)
	at sun.misc.Launcher$AppClassLoader.loadClass(Launcher.java:301)
	at java.lang.ClassLoader.loadClass(ClassLoader.java:252)
	at java.lang.ClassLoader.loadClassInternal(ClassLoader.java:320)


FAILED:  <init>.org.apache.hadoop.hdfs.TestSetTimes

Error Message:
org/apache/hadoop/conf/Configuration

Stack Trace:
java.lang.NoClassDefFoundError: org/apache/hadoop/conf/Configuration
	at java.lang.Class.forName0(Native Method)
	at java.lang.Class.forName(Class.java:169)
Caused by: java.lang.ClassNotFoundException: org.apache.hadoop.conf.Configuration
	at java.net.URLClassLoader$1.run(URLClassLoader.java:200)
	at java.security.AccessController.doPrivileged(Native Method)
	at java.net.URLClassLoader.findClass(URLClassLoader.java:188)
	at java.lang.ClassLoader.loadClass(ClassLoader.java:307)
	at sun.misc.Launcher$AppClassLoader.loadClass(Launcher.java:301)
	at java.lang.ClassLoader.loadClass(ClassLoader.java:252)
	at java.lang.ClassLoader.loadClassInternal(ClassLoader.java:320)


REGRESSION:  org.apache.hadoop.hdfs.TestSetrepDecreasing.testSetrepDecreasing

Error Message:
org/apache/hadoop/conf/Configuration

Stack Trace:
java.lang.NoClassDefFoundError: org/apache/hadoop/conf/Configuration
	at org.apache.hadoop.hdfs.TestSetrepDecreasing.testSetrepDecreasing(TestSetrepDecreasing.java:26)
Caused by: java.lang.ClassNotFoundException: org.apache.hadoop.conf.Configuration
	at java.net.URLClassLoader$1.run(URLClassLoader.java:200)
	at java.security.AccessController.doPrivileged(Native Method)
	at java.net.URLClassLoader.findClass(URLClassLoader.java:188)
	at java.lang.ClassLoader.loadClass(ClassLoader.java:307)
	at sun.misc.Launcher$AppClassLoader.loadClass(Launcher.java:301)
	at java.lang.ClassLoader.loadClass(ClassLoader.java:252)
	at java.lang.ClassLoader.loadClassInternal(ClassLoader.java:320)


FAILED:  <init>.org.apache.hadoop.hdfs.TestSetrepIncreasing

Error Message:
org/apache/hadoop/conf/Configuration

Stack Trace:
java.lang.NoClassDefFoundError: org/apache/hadoop/conf/Configuration
	at java.lang.Class.forName0(Native Method)
	at java.lang.Class.forName(Class.java:169)
Caused by: java.lang.ClassNotFoundException: org.apache.hadoop.conf.Configuration
	at java.net.URLClassLoader$1.run(URLClassLoader.java:200)
	at java.security.AccessController.doPrivileged(Native Method)
	at java.net.URLClassLoader.findClass(URLClassLoader.java:188)
	at java.lang.ClassLoader.loadClass(ClassLoader.java:307)
	at sun.misc.Launcher$AppClassLoader.loadClass(Launcher.java:301)
	at java.lang.ClassLoader.loadClass(ClassLoader.java:252)
	at java.lang.ClassLoader.loadClassInternal(ClassLoader.java:320)


FAILED:  <init>.org.apache.hadoop.hdfs.TestSmallBlock

Error Message:
org/apache/hadoop/conf/Configuration

Stack Trace:
java.lang.NoClassDefFoundError: org/apache/hadoop/conf/Configuration
	at java.lang.Class.forName0(Native Method)
	at java.lang.Class.forName(Class.java:169)
Caused by: java.lang.ClassNotFoundException: org.apache.hadoop.conf.Configuration
	at java.net.URLClassLoader$1.run(URLClassLoader.java:200)
	at java.security.AccessController.doPrivileged(Native Method)
	at java.net.URLClassLoader.findClass(URLClassLoader.java:188)
	at java.lang.ClassLoader.loadClass(ClassLoader.java:307)
	at sun.misc.Launcher$AppClassLoader.loadClass(Launcher.java:301)
	at java.lang.ClassLoader.loadClass(ClassLoader.java:252)
	at java.lang.ClassLoader.loadClassInternal(ClassLoader.java:320)


FAILED:  <init>.org.apache.hadoop.hdfs.security.TestAccessToken

Error Message:
org/apache/hadoop/io/Writable

Stack Trace:
java.lang.NoClassDefFoundError: org/apache/hadoop/io/Writable
	at java.lang.Class.forName0(Native Method)
	at java.lang.Class.forName(Class.java:169)
Caused by: java.lang.ClassNotFoundException: org.apache.hadoop.io.Writable
	at java.net.URLClassLoader$1.run(URLClassLoader.java:200)
	at java.security.AccessController.doPrivileged(Native Method)
	at java.net.URLClassLoader.findClass(URLClassLoader.java:188)
	at java.lang.ClassLoader.loadClass(ClassLoader.java:307)
	at sun.misc.Launcher$AppClassLoader.loadClass(Launcher.java:301)
	at java.lang.ClassLoader.loadClass(ClassLoader.java:252)
	at java.lang.ClassLoader.loadClassInternal(ClassLoader.java:320)


FAILED:  <init>.org.apache.hadoop.hdfs.security.TestClientProtocolWithDelegationToken

Error Message:
org/apache/hadoop/security/token/SecretManager

Stack Trace:
java.lang.NoClassDefFoundError: org/apache/hadoop/security/token/SecretManager
	at java.lang.Class.forName0(Native Method)
	at java.lang.Class.forName(Class.java:169)
Caused by: java.lang.ClassNotFoundException: org.apache.hadoop.security.token.SecretManager
	at java.net.URLClassLoader$1.run(URLClassLoader.java:200)
	at java.security.AccessController.doPrivileged(Native Method)
	at java.net.URLClassLoader.findClass(URLClassLoader.java:188)
	at java.lang.ClassLoader.loadClass(ClassLoader.java:307)
	at sun.misc.Launcher$AppClassLoader.loadClass(Launcher.java:301)
	at java.lang.ClassLoader.loadClass(ClassLoader.java:252)
	at java.lang.ClassLoader.loadClassInternal(ClassLoader.java:320)


FAILED:  <init>.org.apache.hadoop.hdfs.security.TestDelegationToken

Error Message:
org/apache/hadoop/conf/Configuration

Stack Trace:
java.lang.NoClassDefFoundError: org/apache/hadoop/conf/Configuration
	at java.lang.Class.forName0(Native Method)
	at java.lang.Class.forName(Class.java:169)
Caused by: java.lang.ClassNotFoundException: org.apache.hadoop.conf.Configuration
	at java.net.URLClassLoader$1.run(URLClassLoader.java:200)
	at java.security.AccessController.doPrivileged(Native Method)
	at java.net.URLClassLoader.findClass(URLClassLoader.java:188)
	at java.lang.ClassLoader.loadClass(ClassLoader.java:307)
	at sun.misc.Launcher$AppClassLoader.loadClass(Launcher.java:301)
	at java.lang.ClassLoader.loadClass(ClassLoader.java:252)
	at java.lang.ClassLoader.loadClassInternal(ClassLoader.java:320)


FAILED:  <init>.org.apache.hadoop.hdfs.security.TestDelegationTokenForProxyUser

Error Message:
org/apache/hadoop/conf/Configuration

Stack Trace:
java.lang.NoClassDefFoundError: org/apache/hadoop/conf/Configuration
	at java.lang.Class.forName0(Native Method)
	at java.lang.Class.forName(Class.java:169)
Caused by: java.lang.ClassNotFoundException: org.apache.hadoop.conf.Configuration
	at java.net.URLClassLoader$1.run(URLClassLoader.java:200)
	at java.security.AccessController.doPrivileged(Native Method)
	at java.net.URLClassLoader.findClass(URLClassLoader.java:188)
	at java.lang.ClassLoader.loadClass(ClassLoader.java:307)
	at sun.misc.Launcher$AppClassLoader.loadClass(Launcher.java:301)
	at java.lang.ClassLoader.loadClass(ClassLoader.java:252)
	at java.lang.ClassLoader.loadClassInternal(ClassLoader.java:320)


FAILED:  <init>.org.apache.hadoop.hdfs.server.balancer.TestBalancer

Error Message:
org/apache/hadoop/conf/Configuration

Stack Trace:
java.lang.NoClassDefFoundError: org/apache/hadoop/conf/Configuration
	at java.lang.Class.forName0(Native Method)
	at java.lang.Class.forName(Class.java:169)
Caused by: java.lang.ClassNotFoundException: org.apache.hadoop.conf.Configuration
	at java.net.URLClassLoader$1.run(URLClassLoader.java:200)
	at java.security.AccessController.doPrivileged(Native Method)
	at java.net.URLClassLoader.findClass(URLClassLoader.java:188)
	at java.lang.ClassLoader.loadClass(ClassLoader.java:307)
	at sun.misc.Launcher$AppClassLoader.loadClass(Launcher.java:301)
	at java.lang.ClassLoader.loadClass(ClassLoader.java:252)
	at java.lang.ClassLoader.loadClassInternal(ClassLoader.java:320)


FAILED:  <init>.org.apache.hadoop.hdfs.server.common.TestDistributedUpgrade

Error Message:
org/apache/hadoop/conf/Configuration

Stack Trace:
java.lang.NoClassDefFoundError: org/apache/hadoop/conf/Configuration
	at java.lang.Class.forName0(Native Method)
	at java.lang.Class.forName(Class.java:169)
Caused by: java.lang.ClassNotFoundException: org.apache.hadoop.conf.Configuration
	at java.net.URLClassLoader$1.run(URLClassLoader.java:200)
	at java.security.AccessController.doPrivileged(Native Method)
	at java.net.URLClassLoader.findClass(URLClassLoader.java:188)
	at java.lang.ClassLoader.loadClass(ClassLoader.java:307)
	at sun.misc.Launcher$AppClassLoader.loadClass(Launcher.java:301)
	at java.lang.ClassLoader.loadClass(ClassLoader.java:252)
	at java.lang.ClassLoader.loadClassInternal(ClassLoader.java:320)


FAILED:  <init>.org.apache.hadoop.hdfs.server.datanode.TestBlockReport

Error Message:
org/apache/hadoop/fs/FileSystem

Stack Trace:
java.lang.NoClassDefFoundError: org/apache/hadoop/fs/FileSystem
	at java.lang.Class.forName0(Native Method)
	at java.lang.Class.forName(Class.java:169)
Caused by: java.lang.ClassNotFoundException: org.apache.hadoop.fs.FileSystem
	at java.net.URLClassLoader$1.run(URLClassLoader.java:200)
	at java.security.AccessController.doPrivileged(Native Method)
	at java.net.URLClassLoader.findClass(URLClassLoader.java:188)
	at java.lang.ClassLoader.loadClass(ClassLoader.java:307)
	at sun.misc.Launcher$AppClassLoader.loadClass(Launcher.java:301)
	at java.lang.ClassLoader.loadClass(ClassLoader.java:252)
	at java.lang.ClassLoader.loadClassInternal(ClassLoader.java:320)


FAILED:  <init>.org.apache.hadoop.hdfs.server.datanode.TestDataNodeMetrics

Error Message:
org/apache/hadoop/conf/Configuration

Stack Trace:
java.lang.NoClassDefFoundError: org/apache/hadoop/conf/Configuration
	at java.lang.Class.forName0(Native Method)
	at java.lang.Class.forName(Class.java:169)
Caused by: java.lang.ClassNotFoundException: org.apache.hadoop.conf.Configuration
	at java.net.URLClassLoader$1.run(URLClassLoader.java:200)
	at java.security.AccessController.doPrivileged(Native Method)
	at java.net.URLClassLoader.findClass(URLClassLoader.java:188)
	at java.lang.ClassLoader.loadClass(ClassLoader.java:307)
	at sun.misc.Launcher$AppClassLoader.loadClass(Launcher.java:301)
	at java.lang.ClassLoader.loadClass(ClassLoader.java:252)
	at java.lang.ClassLoader.loadClassInternal(ClassLoader.java:320)


FAILED:  <init>.org.apache.hadoop.hdfs.server.datanode.TestDataNodeVolumeFailure

Error Message:
org/apache/hadoop/conf/Configuration

Stack Trace:
java.lang.NoClassDefFoundError: org/apache/hadoop/conf/Configuration
	at java.lang.Class.forName0(Native Method)
	at java.lang.Class.forName(Class.java:169)
Caused by: java.lang.ClassNotFoundException: org.apache.hadoop.conf.Configuration
	at java.net.URLClassLoader$1.run(URLClassLoader.java:200)
	at java.security.AccessController.doPrivileged(Native Method)
	at java.net.URLClassLoader.findClass(URLClassLoader.java:188)
	at java.lang.ClassLoader.loadClass(ClassLoader.java:307)
	at sun.misc.Launcher$AppClassLoader.loadClass(Launcher.java:301)
	at java.lang.ClassLoader.loadClass(ClassLoader.java:252)
	at java.lang.ClassLoader.loadClassInternal(ClassLoader.java:320)


FAILED:  <init>.org.apache.hadoop.hdfs.server.datanode.TestDatanodeRestart

Error Message:
org/apache/hadoop/conf/Configuration

Stack Trace:
java.lang.NoClassDefFoundError: org/apache/hadoop/conf/Configuration
	at java.lang.Class.forName0(Native Method)
	at java.lang.Class.forName(Class.java:169)
Caused by: java.lang.ClassNotFoundException: org.apache.hadoop.conf.Configuration
	at java.net.URLClassLoader$1.run(URLClassLoader.java:200)
	at java.security.AccessController.doPrivileged(Native Method)
	at java.net.URLClassLoader.findClass(URLClassLoader.java:188)
	at java.lang.ClassLoader.loadClass(ClassLoader.java:307)
	at sun.misc.Launcher$AppClassLoader.loadClass(Launcher.java:301)
	at java.lang.ClassLoader.loadClass(ClassLoader.java:252)
	at java.lang.ClassLoader.loadClassInternal(ClassLoader.java:320)


FAILED:  <init>.org.apache.hadoop.hdfs.server.datanode.TestReplicasMap

Error Message:
org/apache/hadoop/io/Writable

Stack Trace:
java.lang.NoClassDefFoundError: org/apache/hadoop/io/Writable
	at java.lang.ClassLoader.defineClass1(Native Method)
	at java.lang.ClassLoader.defineClass(ClassLoader.java:621)
	at java.security.SecureClassLoader.defineClass(SecureClassLoader.java:124)
	at java.net.URLClassLoader.defineClass(URLClassLoader.java:260)
	at java.net.URLClassLoader.access$000(URLClassLoader.java:56)
	at java.net.URLClassLoader$1.run(URLClassLoader.java:195)
	at java.security.AccessController.doPrivileged(Native Method)
	at java.net.URLClassLoader.findClass(URLClassLoader.java:188)
	at java.lang.ClassLoader.loadClass(ClassLoader.java:307)
	at sun.misc.Launcher$AppClassLoader.loadClass(Launcher.java:301)
	at java.lang.ClassLoader.loadClass(ClassLoader.java:252)
	at java.lang.ClassLoader.loadClassInternal(ClassLoader.java:320)
	at java.lang.ClassLoader.defineClass1(Native Method)
	at java.lang.ClassLoader.defineClass(ClassLoader.java:621)
	at java.security.SecureClassLoader.defineClass(SecureClassLoader.java:124)
	at java.net.URLClassLoader.defineClass(URLClassLoader.java:260)
	at java.net.URLClassLoader.access$000(URLClassLoader.java:56)
	at java.net.URLClassLoader$1.run(URLClassLoader.java:195)
	at java.security.AccessController.doPrivileged(Native Method)
	at java.net.URLClassLoader.findClass(URLClassLoader.java:188)
	at java.lang.ClassLoader.loadClass(ClassLoader.java:307)
	at sun.misc.Launcher$AppClassLoader.loadClass(Launcher.java:301)
	at java.lang.ClassLoader.loadClass(ClassLoader.java:252)
	at java.lang.ClassLoader.loadClassInternal(ClassLoader.java:320)
	at java.lang.Class.forName0(Native Method)
	at java.lang.Class.forName(Class.java:169)
Caused by: java.lang.ClassNotFoundException: org.apache.hadoop.io.Writable
	at java.net.URLClassLoader$1.run(URLClassLoader.java:200)
	at java.security.AccessController.doPrivileged(Native Method)
	at java.net.URLClassLoader.findClass(URLClassLoader.java:188)
	at java.lang.ClassLoader.loadClass(ClassLoader.java:307)
	at sun.misc.Launcher$AppClassLoader.loadClass(Launcher.java:301)
	at java.lang.ClassLoader.loadClass(ClassLoader.java:252)
	at java.lang.ClassLoader.loadClassInternal(ClassLoader.java:320)


FAILED:  <init>.org.apache.hadoop.hdfs.server.datanode.TestWriteToReplica

Error Message:
org/apache/hadoop/io/Writable

Stack Trace:
java.lang.NoClassDefFoundError: org/apache/hadoop/io/Writable
	at java.lang.ClassLoader.defineClass1(Native Method)
	at java.lang.ClassLoader.defineClass(ClassLoader.java:621)
	at java.security.SecureClassLoader.defineClass(SecureClassLoader.java:124)
	at java.net.URLClassLoader.defineClass(URLClassLoader.java:260)
	at java.net.URLClassLoader.access$000(URLClassLoader.java:56)
	at java.net.URLClassLoader$1.run(URLClassLoader.java:195)
	at java.security.AccessController.doPrivileged(Native Method)
	at java.net.URLClassLoader.findClass(URLClassLoader.java:188)
	at java.lang.ClassLoader.loadClass(ClassLoader.java:307)
	at sun.misc.Launcher$AppClassLoader.loadClass(Launcher.java:301)
	at java.lang.ClassLoader.loadClass(ClassLoader.java:252)
	at java.lang.ClassLoader.loadClassInternal(ClassLoader.java:320)
	at java.lang.ClassLoader.defineClass1(Native Method)
	at java.lang.ClassLoader.defineClass(ClassLoader.java:621)
	at java.security.SecureClassLoader.defineClass(SecureClassLoader.java:124)
	at java.net.URLClassLoader.defineClass(URLClassLoader.java:260)
	at java.net.URLClassLoader.access$000(URLClassLoader.java:56)
	at java.net.URLClassLoader$1.run(URLClassLoader.java:195)
	at java.security.AccessController.doPrivileged(Native Method)
	at java.net.URLClassLoader.findClass(URLClassLoader.java:188)
	at java.lang.ClassLoader.loadClass(ClassLoader.java:307)
	at sun.misc.Launcher$AppClassLoader.loadClass(Launcher.java:301)
	at java.lang.ClassLoader.loadClass(ClassLoader.java:252)
	at java.lang.ClassLoader.loadClassInternal(ClassLoader.java:320)
	at java.lang.Class.forName0(Native Method)
	at java.lang.Class.forName(Class.java:169)
Caused by: java.lang.ClassNotFoundException: org.apache.hadoop.io.Writable
	at java.net.URLClassLoader$1.run(URLClassLoader.java:200)
	at java.security.AccessController.doPrivileged(Native Method)
	at java.net.URLClassLoader.findClass(URLClassLoader.java:188)
	at java.lang.ClassLoader.loadClass(ClassLoader.java:307)
	at sun.misc.Launcher$AppClassLoader.loadClass(Launcher.java:301)
	at java.lang.ClassLoader.loadClass(ClassLoader.java:252)
	at java.lang.ClassLoader.loadClassInternal(ClassLoader.java:320)


FAILED:  <init>.org.apache.hadoop.hdfs.server.namenode.TestAccessTokenWithDFS

Error Message:
org/apache/hadoop/conf/Configuration

Stack Trace:
java.lang.NoClassDefFoundError: org/apache/hadoop/conf/Configuration
	at java.lang.Class.forName0(Native Method)
	at java.lang.Class.forName(Class.java:169)
Caused by: java.lang.ClassNotFoundException: org.apache.hadoop.conf.Configuration
	at java.net.URLClassLoader$1.run(URLClassLoader.java:200)
	at java.security.AccessController.doPrivileged(Native Method)
	at java.net.URLClassLoader.findClass(URLClassLoader.java:188)
	at java.lang.ClassLoader.loadClass(ClassLoader.java:307)
	at sun.misc.Launcher$AppClassLoader.loadClass(Launcher.java:301)
	at java.lang.ClassLoader.loadClass(ClassLoader.java:252)
	at java.lang.ClassLoader.loadClassInternal(ClassLoader.java:320)


FAILED:  <init>.org.apache.hadoop.hdfs.server.namenode.TestBlockUnderConstruction

Error Message:
org/apache/hadoop/conf/Configuration

Stack Trace:
java.lang.NoClassDefFoundError: org/apache/hadoop/conf/Configuration
	at java.lang.Class.forName0(Native Method)
	at java.lang.Class.forName(Class.java:169)
Caused by: java.lang.ClassNotFoundException: org.apache.hadoop.conf.Configuration
	at java.net.URLClassLoader$1.run(URLClassLoader.java:200)
	at java.security.AccessController.doPrivileged(Native Method)
	at java.net.URLClassLoader.findClass(URLClassLoader.java:188)
	at java.lang.ClassLoader.loadClass(ClassLoader.java:307)
	at sun.misc.Launcher$AppClassLoader.loadClass(Launcher.java:301)
	at java.lang.ClassLoader.loadClass(ClassLoader.java:252)
	at java.lang.ClassLoader.loadClassInternal(ClassLoader.java:320)


FAILED:  <init>.org.apache.hadoop.hdfs.server.namenode.TestBlocksWithNotEnoughRacks

Error Message:
org/apache/hadoop/conf/Configuration

Stack Trace:
java.lang.NoClassDefFoundError: org/apache/hadoop/conf/Configuration
	at java.lang.Class.forName0(Native Method)
	at java.lang.Class.forName(Class.java:169)
Caused by: java.lang.ClassNotFoundException: org.apache.hadoop.conf.Configuration
	at java.net.URLClassLoader$1.run(URLClassLoader.java:200)
	at java.security.AccessController.doPrivileged(Native Method)
	at java.net.URLClassLoader.findClass(URLClassLoader.java:188)
	at java.lang.ClassLoader.loadClass(ClassLoader.java:307)
	at sun.misc.Launcher$AppClassLoader.loadClass(Launcher.java:301)
	at java.lang.ClassLoader.loadClass(ClassLoader.java:252)
	at java.lang.ClassLoader.loadClassInternal(ClassLoader.java:320)


FAILED:  <init>.org.apache.hadoop.hdfs.server.namenode.TestCheckPointForSecurityTokens

Error Message:
org/apache/hadoop/conf/Configuration

Stack Trace:
java.lang.NoClassDefFoundError: org/apache/hadoop/conf/Configuration
	at java.lang.Class.forName0(Native Method)
	at java.lang.Class.forName(Class.java:169)
Caused by: java.lang.ClassNotFoundException: org.apache.hadoop.conf.Configuration
	at java.net.URLClassLoader$1.run(URLClassLoader.java:200)
	at java.security.AccessController.doPrivileged(Native Method)
	at java.net.URLClassLoader.findClass(URLClassLoader.java:188)
	at java.lang.ClassLoader.loadClass(ClassLoader.java:307)
	at sun.misc.Launcher$AppClassLoader.loadClass(Launcher.java:301)
	at java.lang.ClassLoader.loadClass(ClassLoader.java:252)
	at java.lang.ClassLoader.loadClassInternal(ClassLoader.java:320)


FAILED:  <init>.org.apache.hadoop.hdfs.server.namenode.TestCorruptFilesJsp

Error Message:
org/apache/hadoop/fs/ChecksumException

Stack Trace:
java.lang.NoClassDefFoundError: org/apache/hadoop/fs/ChecksumException
	at java.lang.Class.forName0(Native Method)
	at java.lang.Class.forName(Class.java:169)
Caused by: java.lang.ClassNotFoundException: org.apache.hadoop.fs.ChecksumException
	at java.net.URLClassLoader$1.run(URLClassLoader.java:200)
	at java.security.AccessController.doPrivileged(Native Method)
	at java.net.URLClassLoader.findClass(URLClassLoader.java:188)
	at java.lang.ClassLoader.loadClass(ClassLoader.java:307)
	at sun.misc.Launcher$AppClassLoader.loadClass(Launcher.java:301)
	at java.lang.ClassLoader.loadClass(ClassLoader.java:252)
	at java.lang.ClassLoader.loadClassInternal(ClassLoader.java:320)


FAILED:  org.apache.hadoop.hdfs.server.namenode.TestCorruptReplicaInfo.initializationError

Error Message:
org/apache/hadoop/io/Writable

Stack Trace:
java.lang.NoClassDefFoundError: org/apache/hadoop/io/Writable
	at java.lang.ClassLoader.defineClass1(Native Method)
	at java.lang.ClassLoader.defineClass(ClassLoader.java:621)
	at java.security.SecureClassLoader.defineClass(SecureClassLoader.java:124)
	at java.net.URLClassLoader.defineClass(URLClassLoader.java:260)
	at java.net.URLClassLoader.access$000(URLClassLoader.java:56)
	at java.net.URLClassLoader$1.run(URLClassLoader.java:195)
	at java.security.AccessController.doPrivileged(Native Method)
	at java.net.URLClassLoader.findClass(URLClassLoader.java:188)
	at java.lang.ClassLoader.loadClass(ClassLoader.java:307)
	at sun.misc.Launcher$AppClassLoader.loadClass(Launcher.java:301)
	at java.lang.ClassLoader.loadClass(ClassLoader.java:252)
	at java.lang.ClassLoader.loadClassInternal(ClassLoader.java:320)
	at java.lang.Class.getDeclaredMethods0(Native Method)
	at java.lang.Class.privateGetDeclaredMethods(Class.java:2427)
	at java.lang.Class.getDeclaredMethods(Class.java:1791)
	at java.lang.reflect.Constructor.newInstance(Constructor.java:513)
Caused by: java.lang.ClassNotFoundException: org.apache.hadoop.io.Writable
	at java.net.URLClassLoader$1.run(URLClassLoader.java:200)
	at java.security.AccessController.doPrivileged(Native Method)
	at java.net.URLClassLoader.findClass(URLClassLoader.java:188)
	at java.lang.ClassLoader.loadClass(ClassLoader.java:307)
	at sun.misc.Launcher$AppClassLoader.loadClass(Launcher.java:301)
	at java.lang.ClassLoader.loadClass(ClassLoader.java:252)
	at java.lang.ClassLoader.loadClassInternal(ClassLoader.java:320)


FAILED:  <init>.org.apache.hadoop.hdfs.server.namenode.TestDecommissioningStatus

Error Message:
org/apache/hadoop/conf/Configuration

Stack Trace:
java.lang.NoClassDefFoundError: org/apache/hadoop/conf/Configuration
	at java.lang.Class.forName0(Native Method)
	at java.lang.Class.forName(Class.java:169)
Caused by: java.lang.ClassNotFoundException: org.apache.hadoop.conf.Configuration
	at java.net.URLClassLoader$1.run(URLClassLoader.java:200)
	at java.security.AccessController.doPrivileged(Native Method)
	at java.net.URLClassLoader.findClass(URLClassLoader.java:188)
	at java.lang.ClassLoader.loadClass(ClassLoader.java:307)
	at sun.misc.Launcher$AppClassLoader.loadClass(Launcher.java:301)
	at java.lang.ClassLoader.loadClass(ClassLoader.java:252)
	at java.lang.ClassLoader.loadClassInternal(ClassLoader.java:320)


FAILED:  <init>.org.apache.hadoop.hdfs.server.namenode.TestEditLogRace

Error Message:
org/apache/hadoop/conf/Configuration

Stack Trace:
java.lang.NoClassDefFoundError: org/apache/hadoop/conf/Configuration
	at java.lang.Class.forName0(Native Method)
	at java.lang.Class.forName(Class.java:169)
Caused by: java.lang.ClassNotFoundException: org.apache.hadoop.conf.Configuration
	at java.net.URLClassLoader$1.run(URLClassLoader.java:200)
	at java.security.AccessController.doPrivileged(Native Method)
	at java.net.URLClassLoader.findClass(URLClassLoader.java:188)
	at java.lang.ClassLoader.loadClass(ClassLoader.java:307)
	at sun.misc.Launcher$AppClassLoader.loadClass(Launcher.java:301)
	at java.lang.ClassLoader.loadClass(ClassLoader.java:252)
	at java.lang.ClassLoader.loadClassInternal(ClassLoader.java:320)


REGRESSION:  org.apache.hadoop.hdfs.server.namenode.TestFileLimit.testFileLimit

Error Message:
org/apache/hadoop/ipc/Server$Handler

Stack Trace:
java.lang.NoClassDefFoundError: org/apache/hadoop/ipc/Server$Handler
	at org.apache.hadoop.ipc.Server.start(Server.java:1537)
	at org.apache.hadoop.hdfs.server.namenode.NameNode.activate(NameNode.java:327)
	at org.apache.hadoop.hdfs.server.namenode.NameNode.initialize(NameNode.java:313)
	at org.apache.hadoop.hdfs.server.namenode.NameNode.<init>(NameNode.java:433)
	at org.apache.hadoop.hdfs.server.namenode.NameNode.<init>(NameNode.java:421)
	at org.apache.hadoop.hdfs.server.namenode.NameNode.createNameNode(NameNode.java:1359)
	at org.apache.hadoop.hdfs.MiniDFSCluster.<init>(MiniDFSCluster.java:311)
	at org.apache.hadoop.hdfs.MiniDFSCluster.<init>(MiniDFSCluster.java:138)
	at org.apache.hadoop.hdfs.server.namenode.TestFileLimit.testFileLimit(TestFileLimit.java:88)
Caused by: java.lang.ClassNotFoundException: org.apache.hadoop.ipc.Server$Handler
	at java.net.URLClassLoader$1.run(URLClassLoader.java:197)
	at java.security.AccessController.doPrivileged(Native Method)
	at java.net.URLClassLoader.findClass(URLClassLoader.java:188)
	at java.lang.ClassLoader.loadClass(ClassLoader.java:307)
	at sun.misc.Launcher$AppClassLoader.loadClass(Launcher.java:301)
	at java.lang.ClassLoader.loadClass(ClassLoader.java:252)
	at java.lang.ClassLoader.loadClassInternal(ClassLoader.java:320)
Caused by: java.util.zip.ZipException: error reading zip file
	at java.util.zip.ZipFile.read(Native Method)
	at java.util.zip.ZipFile.access$1200(ZipFile.java:29)
	at java.util.zip.ZipFile$ZipFileInputStream.read(ZipFile.java:447)
	at java.util.zip.ZipFile$1.fill(ZipFile.java:230)
	at java.util.zip.InflaterInputStream.read(InflaterInputStream.java:141)
	at sun.misc.Resource.getBytes(Resource.java:97)
	at java.net.URLClassLoader.defineClass(URLClassLoader.java:256)
	at java.net.URLClassLoader.access$000(URLClassLoader.java:56)
	at java.net.URLClassLoader$1.run(URLClassLoader.java:195)


REGRESSION:  org.apache.hadoop.hdfs.server.namenode.TestFileLimit.testFileLimitSimulated

Error Message:
java.util.zip.ZipException: error reading zip file

Stack Trace:
java.lang.RuntimeException: java.util.zip.ZipException: error reading zip file
	at org.apache.hadoop.conf.Configuration.loadResource(Configuration.java:1513)
	at org.apache.hadoop.conf.Configuration.loadResources(Configuration.java:1378)
	at org.apache.hadoop.conf.Configuration.getProps(Configuration.java:1324)
	at org.apache.hadoop.conf.Configuration.set(Configuration.java:577)
	at org.apache.hadoop.conf.Configuration.setLong(Configuration.java:712)
	at org.apache.hadoop.hdfs.server.namenode.TestFileLimit.testFileLimit(TestFileLimit.java:80)
	at org.apache.hadoop.hdfs.server.namenode.TestFileLimit.testFileLimitSimulated(TestFileLimit.java:170)
Caused by: java.util.zip.ZipException: error reading zip file
	at java.util.zip.ZipFile.read(Native Method)
	at java.util.zip.ZipFile.access$1200(ZipFile.java:29)
	at java.util.zip.ZipFile$ZipFileInputStream.read(ZipFile.java:447)
	at java.util.zip.ZipFile$1.fill(ZipFile.java:230)
	at java.util.zip.InflaterInputStream.read(InflaterInputStream.java:141)
	at java.util.zip.InflaterInputStream.read(InflaterInputStream.java:105)
	at java.io.FilterInputStream.read(FilterInputStream.java:66)
	at com.sun.org.apache.xerces.internal.impl.XMLEntityManager$RewindableInputStream.read(XMLEntityManager.java:2910)
	at com.sun.org.apache.xerces.internal.impl.XMLEntityManager.setupCurrentEntity(XMLEntityManager.java:704)
	at com.sun.org.apache.xerces.internal.impl.XMLVersionDetector.determineDocVersion(XMLVersionDetector.java:186)
	at com.sun.org.apache.xerces.internal.parsers.XML11Configuration.parse(XML11Configuration.java:771)
	at com.sun.org.apache.xerces.internal.parsers.XML11Configuration.parse(XML11Configuration.java:737)
	at com.sun.org.apache.xerces.internal.parsers.XMLParser.parse(XMLParser.java:107)
	at com.sun.org.apache.xerces.internal.parsers.DOMParser.parse(DOMParser.java:225)
	at com.sun.org.apache.xerces.internal.jaxp.DocumentBuilderImpl.parse(DocumentBuilderImpl.java:283)
	at javax.xml.parsers.DocumentBuilder.parse(DocumentBuilder.java:180)
	at org.apache.hadoop.conf.Configuration.loadResource(Configuration.java:1427)


FAILED:  <init>.org.apache.hadoop.hdfs.server.namenode.TestFsck

Error Message:
org/apache/hadoop/util/Tool

Stack Trace:
java.lang.NoClassDefFoundError: org/apache/hadoop/util/Tool
	at java.lang.Class.forName0(Native Method)
	at java.lang.Class.forName(Class.java:169)
Caused by: java.lang.ClassNotFoundException: org.apache.hadoop.util.Tool
	at java.net.URLClassLoader$1.run(URLClassLoader.java:200)
	at java.security.AccessController.doPrivileged(Native Method)
	at java.net.URLClassLoader.findClass(URLClassLoader.java:188)
	at java.lang.ClassLoader.loadClass(ClassLoader.java:307)
	at sun.misc.Launcher$AppClassLoader.loadClass(Launcher.java:301)
	at java.lang.ClassLoader.loadClass(ClassLoader.java:252)
	at java.lang.ClassLoader.loadClassInternal(ClassLoader.java:320)


FAILED:  <init>.org.apache.hadoop.hdfs.server.namenode.TestHDFSConcat

Error Message:
org/apache/hadoop/fs/FileSystem

Stack Trace:
java.lang.NoClassDefFoundError: org/apache/hadoop/fs/FileSystem
	at java.lang.Class.forName0(Native Method)
	at java.lang.Class.forName(Class.java:169)
Caused by: java.lang.ClassNotFoundException: org.apache.hadoop.fs.FileSystem
	at java.net.URLClassLoader$1.run(URLClassLoader.java:200)
	at java.security.AccessController.doPrivileged(Native Method)
	at java.net.URLClassLoader.findClass(URLClassLoader.java:188)
	at java.lang.ClassLoader.loadClass(ClassLoader.java:307)
	at sun.misc.Launcher$AppClassLoader.loadClass(Launcher.java:301)
	at java.lang.ClassLoader.loadClass(ClassLoader.java:252)
	at java.lang.ClassLoader.loadClassInternal(ClassLoader.java:320)


FAILED:  <init>.org.apache.hadoop.hdfs.server.namenode.TestHeartbeatHandling

Error Message:
org/apache/hadoop/conf/Configuration

Stack Trace:
java.lang.NoClassDefFoundError: org/apache/hadoop/conf/Configuration
	at java.lang.Class.forName0(Native Method)
	at java.lang.Class.forName(Class.java:169)
Caused by: java.lang.ClassNotFoundException: org.apache.hadoop.conf.Configuration
	at java.net.URLClassLoader$1.run(URLClassLoader.java:200)
	at java.security.AccessController.doPrivileged(Native Method)
	at java.net.URLClassLoader.findClass(URLClassLoader.java:188)
	at java.lang.ClassLoader.loadClass(ClassLoader.java:307)
	at sun.misc.Launcher$AppClassLoader.loadClass(Launcher.java:301)
	at java.lang.ClassLoader.loadClass(ClassLoader.java:252)
	at java.lang.ClassLoader.loadClassInternal(ClassLoader.java:320)


FAILED:  <init>.org.apache.hadoop.hdfs.server.namenode.TestHost2NodesMap

Error Message:
org/apache/hadoop/net/Node

Stack Trace:
java.lang.NoClassDefFoundError: org/apache/hadoop/net/Node
	at java.lang.ClassLoader.defineClass1(Native Method)
	at java.lang.ClassLoader.defineClass(ClassLoader.java:621)
	at java.security.SecureClassLoader.defineClass(SecureClassLoader.java:124)
	at java.net.URLClassLoader.defineClass(URLClassLoader.java:260)
	at java.net.URLClassLoader.access$000(URLClassLoader.java:56)
	at java.net.URLClassLoader$1.run(URLClassLoader.java:195)
	at java.security.AccessController.doPrivileged(Native Method)
	at java.net.URLClassLoader.findClass(URLClassLoader.java:188)
	at java.lang.ClassLoader.loadClass(ClassLoader.java:307)
	at sun.misc.Launcher$AppClassLoader.loadClass(Launcher.java:301)
	at java.lang.ClassLoader.loadClass(ClassLoader.java:252)
	at java.lang.ClassLoader.loadClassInternal(ClassLoader.java:320)
	at java.lang.ClassLoader.defineClass1(Native Method)
	at java.lang.ClassLoader.defineClass(ClassLoader.java:621)
	at java.security.SecureClassLoader.defineClass(SecureClassLoader.java:124)
	at java.net.URLClassLoader.defineClass(URLClassLoader.java:260)
	at java.net.URLClassLoader.access$000(URLClassLoader.java:56)
	at java.net.URLClassLoader$1.run(URLClassLoader.java:195)
	at java.security.AccessController.doPrivileged(Native Method)
	at java.net.URLClassLoader.findClass(URLClassLoader.java:188)
	at java.lang.ClassLoader.loadClass(ClassLoader.java:307)
	at sun.misc.Launcher$AppClassLoader.loadClass(Launcher.java:301)
	at java.lang.ClassLoader.loadClass(ClassLoader.java:252)
	at java.lang.ClassLoader.loadClassInternal(ClassLoader.java:320)
	at org.apache.hadoop.hdfs.server.namenode.TestHost2NodesMap.<clinit>(TestHost2NodesMap.java:27)
	at java.lang.Class.forName0(Native Method)
	at java.lang.Class.forName(Class.java:169)
Caused by: java.lang.ClassNotFoundException: org.apache.hadoop.net.Node
	at java.net.URLClassLoader$1.run(URLClassLoader.java:200)
	at java.security.AccessController.doPrivileged(Native Method)
	at java.net.URLClassLoader.findClass(URLClassLoader.java:188)
	at java.lang.ClassLoader.loadClass(ClassLoader.java:307)
	at sun.misc.Launcher$AppClassLoader.loadClass(Launcher.java:301)
	at java.lang.ClassLoader.loadClass(ClassLoader.java:252)
	at java.lang.ClassLoader.loadClassInternal(ClassLoader.java:320)


FAILED:  <init>.org.apache.hadoop.hdfs.server.namenode.TestLargeDirectoryDelete

Error Message:
org/apache/hadoop/conf/Configuration

Stack Trace:
java.lang.NoClassDefFoundError: org/apache/hadoop/conf/Configuration
	at java.lang.Class.forName0(Native Method)
	at java.lang.Class.forName(Class.java:169)
Caused by: java.lang.ClassNotFoundException: org.apache.hadoop.conf.Configuration
	at java.net.URLClassLoader$1.run(URLClassLoader.java:200)
	at java.security.AccessController.doPrivileged(Native Method)
	at java.net.URLClassLoader.findClass(URLClassLoader.java:188)
	at java.lang.ClassLoader.loadClass(ClassLoader.java:307)
	at sun.misc.Launcher$AppClassLoader.loadClass(Launcher.java:301)
	at java.lang.ClassLoader.loadClass(ClassLoader.java:252)
	at java.lang.ClassLoader.loadClassInternal(ClassLoader.java:320)


FAILED:  <init>.org.apache.hadoop.hdfs.server.namenode.TestMetaSave

Error Message:
org/apache/hadoop/conf/Configuration

Stack Trace:
java.lang.NoClassDefFoundError: org/apache/hadoop/conf/Configuration
	at java.lang.Class.forName0(Native Method)
	at java.lang.Class.forName(Class.java:169)
Caused by: java.lang.ClassNotFoundException: org.apache.hadoop.conf.Configuration
	at java.net.URLClassLoader$1.run(URLClassLoader.java:200)
	at java.security.AccessController.doPrivileged(Native Method)
	at java.net.URLClassLoader.findClass(URLClassLoader.java:188)
	at java.lang.ClassLoader.loadClass(ClassLoader.java:307)
	at sun.misc.Launcher$AppClassLoader.loadClass(Launcher.java:301)
	at java.lang.ClassLoader.loadClass(ClassLoader.java:252)
	at java.lang.ClassLoader.loadClassInternal(ClassLoader.java:320)


FAILED:  <init>.org.apache.hadoop.hdfs.server.namenode.TestNNThroughputBenchmark

Error Message:
org/apache/hadoop/conf/Configuration

Stack Trace:
java.lang.NoClassDefFoundError: org/apache/hadoop/conf/Configuration
	at java.lang.Class.forName0(Native Method)
	at java.lang.Class.forName(Class.java:169)
Caused by: java.lang.ClassNotFoundException: org.apache.hadoop.conf.Configuration
	at java.net.URLClassLoader$1.run(URLClassLoader.java:200)
	at java.security.AccessController.doPrivileged(Native Method)
	at java.net.URLClassLoader.findClass(URLClassLoader.java:188)
	at java.lang.ClassLoader.loadClass(ClassLoader.java:307)
	at sun.misc.Launcher$AppClassLoader.loadClass(Launcher.java:301)
	at java.lang.ClassLoader.loadClass(ClassLoader.java:252)
	at java.lang.ClassLoader.loadClassInternal(ClassLoader.java:320)


FAILED:  <init>.org.apache.hadoop.hdfs.server.namenode.TestNameEditsConfigs

Error Message:
org/apache/hadoop/conf/Configuration

Stack Trace:
java.lang.NoClassDefFoundError: org/apache/hadoop/conf/Configuration
	at java.lang.Class.forName0(Native Method)
	at java.lang.Class.forName(Class.java:169)
Caused by: java.lang.ClassNotFoundException: org.apache.hadoop.conf.Configuration
	at java.net.URLClassLoader$1.run(URLClassLoader.java:200)
	at java.security.AccessController.doPrivileged(Native Method)
	at java.net.URLClassLoader.findClass(URLClassLoader.java:188)
	at java.lang.ClassLoader.loadClass(ClassLoader.java:307)
	at sun.misc.Launcher$AppClassLoader.loadClass(Launcher.java:301)
	at java.lang.ClassLoader.loadClass(ClassLoader.java:252)
	at java.lang.ClassLoader.loadClassInternal(ClassLoader.java:320)


FAILED:  <init>.org.apache.hadoop.hdfs.server.namenode.TestNamenodeCapacityReport

Error Message:
org/apache/hadoop/conf/Configuration

Stack Trace:
java.lang.NoClassDefFoundError: org/apache/hadoop/conf/Configuration
	at java.lang.Class.forName0(Native Method)
	at java.lang.Class.forName(Class.java:169)
Caused by: java.lang.ClassNotFoundException: org.apache.hadoop.conf.Configuration
	at java.net.URLClassLoader$1.run(URLClassLoader.java:200)
	at java.security.AccessController.doPrivileged(Native Method)
	at java.net.URLClassLoader.findClass(URLClassLoader.java:188)
	at java.lang.ClassLoader.loadClass(ClassLoader.java:307)
	at sun.misc.Launcher$AppClassLoader.loadClass(Launcher.java:301)
	at java.lang.ClassLoader.loadClass(ClassLoader.java:252)
	at java.lang.ClassLoader.loadClassInternal(ClassLoader.java:320)


FAILED:  <init>.org.apache.hadoop.hdfs.server.namenode.TestNodeCount

Error Message:
org/apache/hadoop/conf/Configuration

Stack Trace:
java.lang.NoClassDefFoundError: org/apache/hadoop/conf/Configuration
	at java.lang.Class.forName0(Native Method)
	at java.lang.Class.forName(Class.java:169)
Caused by: java.lang.ClassNotFoundException: org.apache.hadoop.conf.Configuration
	at java.net.URLClassLoader$1.run(URLClassLoader.java:200)
	at java.security.AccessController.doPrivileged(Native Method)
	at java.net.URLClassLoader.findClass(URLClassLoader.java:188)
	at java.lang.ClassLoader.loadClass(ClassLoader.java:307)
	at sun.misc.Launcher$AppClassLoader.loadClass(Launcher.java:301)
	at java.lang.ClassLoader.loadClass(ClassLoader.java:252)
	at java.lang.ClassLoader.loadClassInternal(ClassLoader.java:320)


FAILED:  <init>.org.apache.hadoop.hdfs.server.namenode.TestOverReplicatedBlocks

Error Message:
org/apache/hadoop/conf/Configuration

Stack Trace:
java.lang.NoClassDefFoundError: org/apache/hadoop/conf/Configuration
	at java.lang.Class.forName0(Native Method)
	at java.lang.Class.forName(Class.java:169)
Caused by: java.lang.ClassNotFoundException: org.apache.hadoop.conf.Configuration
	at java.net.URLClassLoader$1.run(URLClassLoader.java:200)
	at java.security.AccessController.doPrivileged(Native Method)
	at java.net.URLClassLoader.findClass(URLClassLoader.java:188)
	at java.lang.ClassLoader.loadClass(ClassLoader.java:307)
	at sun.misc.Launcher$AppClassLoader.loadClass(Launcher.java:301)
	at java.lang.ClassLoader.loadClass(ClassLoader.java:252)
	at java.lang.ClassLoader.loadClassInternal(ClassLoader.java:320)


REGRESSION:  org.apache.hadoop.hdfs.server.namenode.TestPendingReplication.testPendingReplication

Error Message:
org/apache/hadoop/util/Daemon

Stack Trace:
java.lang.NoClassDefFoundError: org/apache/hadoop/util/Daemon
	at org.apache.hadoop.hdfs.server.namenode.PendingReplicationBlocks.start(PendingReplicationBlocks.java:59)
	at org.apache.hadoop.hdfs.server.namenode.TestPendingReplication.testPendingReplication(TestPendingReplication.java:34)
Caused by: java.lang.ClassNotFoundException: org.apache.hadoop.util.Daemon
	at java.net.URLClassLoader$1.run(URLClassLoader.java:200)
	at java.security.AccessController.doPrivileged(Native Method)
	at java.net.URLClassLoader.findClass(URLClassLoader.java:188)
	at java.lang.ClassLoader.loadClass(ClassLoader.java:307)
	at sun.misc.Launcher$AppClassLoader.loadClass(Launcher.java:301)
	at java.lang.ClassLoader.loadClass(ClassLoader.java:252)
	at java.lang.ClassLoader.loadClassInternal(ClassLoader.java:320)


FAILED:  <init>.org.apache.hadoop.hdfs.server.namenode.TestReplicationPolicy

Error Message:
org/apache/hadoop/conf/Configuration

Stack Trace:
java.lang.NoClassDefFoundError: org/apache/hadoop/conf/Configuration
	at java.lang.Class.forName0(Native Method)
	at java.lang.Class.forName(Class.java:169)
Caused by: java.lang.ClassNotFoundException: org.apache.hadoop.conf.Configuration
	at java.net.URLClassLoader$1.run(URLClassLoader.java:200)
	at java.security.AccessController.doPrivileged(Native Method)
	at java.net.URLClassLoader.findClass(URLClassLoader.java:188)
	at java.lang.ClassLoader.loadClass(ClassLoader.java:307)
	at sun.misc.Launcher$AppClassLoader.loadClass(Launcher.java:301)
	at java.lang.ClassLoader.loadClass(ClassLoader.java:252)
	at java.lang.ClassLoader.loadClassInternal(ClassLoader.java:320)


FAILED:  <init>.org.apache.hadoop.hdfs.server.namenode.TestSaveNamespace

Error Message:
org/apache/hadoop/conf/Configuration

Stack Trace:
java.lang.NoClassDefFoundError: org/apache/hadoop/conf/Configuration
	at java.lang.Class.forName0(Native Method)
	at java.lang.Class.forName(Class.java:169)
Caused by: java.lang.ClassNotFoundException: org.apache.hadoop.conf.Configuration
	at java.net.URLClassLoader$1.run(URLClassLoader.java:200)
	at java.security.AccessController.doPrivileged(Native Method)
	at java.net.URLClassLoader.findClass(URLClassLoader.java:188)
	at java.lang.ClassLoader.loadClass(ClassLoader.java:307)
	at sun.misc.Launcher$AppClassLoader.loadClass(Launcher.java:301)
	at java.lang.ClassLoader.loadClass(ClassLoader.java:252)
	at java.lang.ClassLoader.loadClassInternal(ClassLoader.java:320)


FAILED:  <init>.org.apache.hadoop.hdfs.server.namenode.TestSecurityTokenEditLog

Error Message:
org/apache/hadoop/conf/Configuration

Stack Trace:
java.lang.NoClassDefFoundError: org/apache/hadoop/conf/Configuration
	at java.lang.Class.forName0(Native Method)
	at java.lang.Class.forName(Class.java:169)
Caused by: java.lang.ClassNotFoundException: org.apache.hadoop.conf.Configuration
	at java.net.URLClassLoader$1.run(URLClassLoader.java:200)
	at java.security.AccessController.doPrivileged(Native Method)
	at java.net.URLClassLoader.findClass(URLClassLoader.java:188)
	at java.lang.ClassLoader.loadClass(ClassLoader.java:307)
	at sun.misc.Launcher$AppClassLoader.loadClass(Launcher.java:301)
	at java.lang.ClassLoader.loadClass(ClassLoader.java:252)
	at java.lang.ClassLoader.loadClassInternal(ClassLoader.java:320)


FAILED:  <init>.org.apache.hadoop.hdfs.server.namenode.TestStartup

Error Message:
org/apache/hadoop/conf/Configuration

Stack Trace:
java.lang.NoClassDefFoundError: org/apache/hadoop/conf/Configuration
	at java.lang.Class.forName0(Native Method)
	at java.lang.Class.forName(Class.java:169)
Caused by: java.lang.ClassNotFoundException: org.apache.hadoop.conf.Configuration
	at java.net.URLClassLoader$1.run(URLClassLoader.java:200)
	at java.security.AccessController.doPrivileged(Native Method)
	at java.net.URLClassLoader.findClass(URLClassLoader.java:188)
	at java.lang.ClassLoader.loadClass(ClassLoader.java:307)
	at sun.misc.Launcher$AppClassLoader.loadClass(Launcher.java:301)
	at java.lang.ClassLoader.loadClass(ClassLoader.java:252)
	at java.lang.ClassLoader.loadClassInternal(ClassLoader.java:320)


FAILED:  <init>.org.apache.hadoop.hdfs.server.namenode.TestStorageRestore

Error Message:
org/apache/hadoop/conf/Configuration

Stack Trace:
java.lang.NoClassDefFoundError: org/apache/hadoop/conf/Configuration
	at java.lang.Class.forName0(Native Method)
	at java.lang.Class.forName(Class.java:169)
Caused by: java.lang.ClassNotFoundException: org.apache.hadoop.conf.Configuration
	at java.net.URLClassLoader$1.run(URLClassLoader.java:200)
	at java.security.AccessController.doPrivileged(Native Method)
	at java.net.URLClassLoader.findClass(URLClassLoader.java:188)
	at java.lang.ClassLoader.loadClass(ClassLoader.java:307)
	at sun.misc.Launcher$AppClassLoader.loadClass(Launcher.java:301)
	at java.lang.ClassLoader.loadClass(ClassLoader.java:252)
	at java.lang.ClassLoader.loadClassInternal(ClassLoader.java:320)


FAILED:  <init>.org.apache.hadoop.hdfs.server.namenode.TestStreamFile

Error Message:
org/apache/hadoop/fs/FSInputStream

Stack Trace:
java.lang.NoClassDefFoundError: org/apache/hadoop/fs/FSInputStream
	at java.lang.Class.forName0(Native Method)
	at java.lang.Class.forName(Class.java:169)
Caused by: java.lang.ClassNotFoundException: org.apache.hadoop.fs.FSInputStream
	at java.net.URLClassLoader$1.run(URLClassLoader.java:200)
	at java.security.AccessController.doPrivileged(Native Method)
	at java.net.URLClassLoader.findClass(URLClassLoader.java:188)
	at java.lang.ClassLoader.loadClass(ClassLoader.java:307)
	at sun.misc.Launcher$AppClassLoader.loadClass(Launcher.java:301)
	at java.lang.ClassLoader.loadClass(ClassLoader.java:252)
	at java.lang.ClassLoader.loadClassInternal(ClassLoader.java:320)


FAILED:  <init>.org.apache.hadoop.hdfs.server.namenode.TestUnderReplicatedBlocks

Error Message:
org/apache/hadoop/conf/Configuration

Stack Trace:
java.lang.NoClassDefFoundError: org/apache/hadoop/conf/Configuration
	at java.lang.Class.forName0(Native Method)
	at java.lang.Class.forName(Class.java:169)
Caused by: java.lang.ClassNotFoundException: org.apache.hadoop.conf.Configuration
	at java.net.URLClassLoader$1.run(URLClassLoader.java:200)
	at java.security.AccessController.doPrivileged(Native Method)
	at java.net.URLClassLoader.findClass(URLClassLoader.java:188)
	at java.lang.ClassLoader.loadClass(ClassLoader.java:307)
	at sun.misc.Launcher$AppClassLoader.loadClass(Launcher.java:301)
	at java.lang.ClassLoader.loadClass(ClassLoader.java:252)
	at java.lang.ClassLoader.loadClassInternal(ClassLoader.java:320)


FAILED:  <init>.org.apache.hadoop.hdfs.server.namenode.metrics.TestNNMetricFilesInGetListingOps

Error Message:
org/apache/hadoop/conf/Configuration

Stack Trace:
java.lang.NoClassDefFoundError: org/apache/hadoop/conf/Configuration
	at java.lang.Class.forName0(Native Method)
	at java.lang.Class.forName(Class.java:169)
Caused by: java.lang.ClassNotFoundException: org.apache.hadoop.conf.Configuration
	at java.net.URLClassLoader$1.run(URLClassLoader.java:200)
	at java.security.AccessController.doPrivileged(Native Method)
	at java.net.URLClassLoader.findClass(URLClassLoader.java:188)
	at java.lang.ClassLoader.loadClass(ClassLoader.java:307)
	at sun.misc.Launcher$AppClassLoader.loadClass(Launcher.java:301)
	at java.lang.ClassLoader.loadClass(ClassLoader.java:252)
	at java.lang.ClassLoader.loadClassInternal(ClassLoader.java:320)


FAILED:  <init>.org.apache.hadoop.hdfs.server.namenode.metrics.TestNameNodeMetrics

Error Message:
org/apache/hadoop/conf/Configuration

Stack Trace:
java.lang.NoClassDefFoundError: org/apache/hadoop/conf/Configuration
	at java.lang.Class.forName0(Native Method)
	at java.lang.Class.forName(Class.java:169)
Caused by: java.lang.ClassNotFoundException: org.apache.hadoop.conf.Configuration
	at java.net.URLClassLoader$1.run(URLClassLoader.java:200)
	at java.security.AccessController.doPrivileged(Native Method)
	at java.net.URLClassLoader.findClass(URLClassLoader.java:188)
	at java.lang.ClassLoader.loadClass(ClassLoader.java:307)
	at sun.misc.Launcher$AppClassLoader.loadClass(Launcher.java:301)
	at java.lang.ClassLoader.loadClass(ClassLoader.java:252)
	at java.lang.ClassLoader.loadClassInternal(ClassLoader.java:320)


REGRESSION:  org.apache.hadoop.hdfs.tools.offlineImageViewer.TestOIVCanReadOldVersions.testOldFSImages

Error Message:
org/apache/hadoop/io/Writable

Stack Trace:
java.lang.NoClassDefFoundError: org/apache/hadoop/io/Writable
	at java.lang.ClassLoader.defineClass1(Native Method)
	at java.lang.ClassLoader.defineClass(ClassLoader.java:621)
	at java.security.SecureClassLoader.defineClass(SecureClassLoader.java:124)
	at java.net.URLClassLoader.defineClass(URLClassLoader.java:260)
	at java.net.URLClassLoader.access$000(URLClassLoader.java:56)
	at java.net.URLClassLoader$1.run(URLClassLoader.java:195)
	at java.security.AccessController.doPrivileged(Native Method)
	at java.net.URLClassLoader.findClass(URLClassLoader.java:188)
	at java.lang.ClassLoader.loadClass(ClassLoader.java:307)
	at sun.misc.Launcher$AppClassLoader.loadClass(Launcher.java:301)
	at java.lang.ClassLoader.loadClass(ClassLoader.java:252)
	at java.lang.ClassLoader.loadClassInternal(ClassLoader.java:320)
	at java.lang.ClassLoader.defineClass1(Native Method)
	at java.lang.ClassLoader.defineClass(ClassLoader.java:621)
	at java.security.SecureClassLoader.defineClass(SecureClassLoader.java:124)
	at java.net.URLClassLoader.defineClass(URLClassLoader.java:260)
	at java.net.URLClassLoader.access$000(URLClassLoader.java:56)
	at java.net.URLClassLoader$1.run(URLClassLoader.java:195)
	at java.security.AccessController.doPrivileged(Native Method)
	at java.net.URLClassLoader.findClass(URLClassLoader.java:188)
	at java.lang.ClassLoader.loadClass(ClassLoader.java:307)
	at sun.misc.Launcher$AppClassLoader.loadClass(Launcher.java:301)
	at java.lang.ClassLoader.loadClass(ClassLoader.java:252)
	at java.lang.ClassLoader.loadClassInternal(ClassLoader.java:320)
	at java.lang.ClassLoader.defineClass1(Native Method)
	at java.lang.ClassLoader.defineClass(ClassLoader.java:621)
	at java.security.SecureClassLoader.defineClass(SecureClassLoader.java:124)
	at java.net.URLClassLoader.defineClass(URLClassLoader.java:260)
	at java.net.URLClassLoader.access$000(URLClassLoader.java:56)
	at java.net.URLClassLoader$1.run(URLClassLoader.java:195)
	at java.security.AccessController.doPrivileged(Native Method)
	at java.net.URLClassLoader.findClass(URLClassLoader.java:188)
	at java.lang.ClassLoader.loadClass(ClassLoader.java:307)
	at sun.misc.Launcher$AppClassLoader.loadClass(Launcher.java:301)
	at java.lang.ClassLoader.loadClass(ClassLoader.java:252)
	at java.lang.ClassLoader.loadClassInternal(ClassLoader.java:320)
	at org.apache.hadoop.hdfs.tools.offlineImageViewer.ImageLoaderCurrent.processINodes(ImageLoaderCurrent.java:319)
	at org.apache.hadoop.hdfs.tools.offlineImageViewer.ImageLoaderCurrent.loadImage(ImageLoaderCurrent.java:154)
	at org.apache.hadoop.hdfs.tools.offlineImageViewer.OfflineImageViewer.go(OfflineImageViewer.java:127)
	at org.apache.hadoop.hdfs.tools.offlineImageViewer.TestOIVCanReadOldVersions.spotCheck(TestOIVCanReadOldVersions.java:108)
	at org.apache.hadoop.hdfs.tools.offlineImageViewer.TestOIVCanReadOldVersions.testOldFSImages(TestOIVCanReadOldVersions.java:98)
Caused by: java.lang.ClassNotFoundException: org.apache.hadoop.io.Writable
	at java.net.URLClassLoader$1.run(URLClassLoader.java:200)
	at java.security.AccessController.doPrivileged(Native Method)
	at java.net.URLClassLoader.findClass(URLClassLoader.java:188)
	at java.lang.ClassLoader.loadClass(ClassLoader.java:307)
	at sun.misc.Launcher$AppClassLoader.loadClass(Launcher.java:301)
	at java.lang.ClassLoader.loadClass(ClassLoader.java:252)
	at java.lang.ClassLoader.loadClassInternal(ClassLoader.java:320)


FAILED:  <init>.org.apache.hadoop.hdfs.tools.offlineImageViewer.TestOfflineImageViewer

Error Message:
org/apache/hadoop/conf/Configuration

Stack Trace:
java.lang.NoClassDefFoundError: org/apache/hadoop/conf/Configuration
	at java.lang.Class.forName0(Native Method)
	at java.lang.Class.forName(Class.java:169)
Caused by: java.lang.ClassNotFoundException: org.apache.hadoop.conf.Configuration
	at java.net.URLClassLoader$1.run(URLClassLoader.java:200)
	at java.security.AccessController.doPrivileged(Native Method)
	at java.net.URLClassLoader.findClass(URLClassLoader.java:188)
	at java.lang.ClassLoader.loadClass(ClassLoader.java:307)
	at sun.misc.Launcher$AppClassLoader.loadClass(Launcher.java:301)
	at java.lang.ClassLoader.loadClass(ClassLoader.java:252)
	at java.lang.ClassLoader.loadClassInternal(ClassLoader.java:320)


FAILED:  <init>.org.apache.hadoop.net.TestNetworkTopology

Error Message:
org/apache/hadoop/net/Node

Stack Trace:
java.lang.NoClassDefFoundError: org/apache/hadoop/net/Node
	at java.lang.Class.forName0(Native Method)
	at java.lang.Class.forName(Class.java:169)
Caused by: java.lang.ClassNotFoundException: org.apache.hadoop.net.Node
	at java.net.URLClassLoader$1.run(URLClassLoader.java:200)
	at java.security.AccessController.doPrivileged(Native Method)
	at java.net.URLClassLoader.findClass(URLClassLoader.java:188)
	at java.lang.ClassLoader.loadClass(ClassLoader.java:307)
	at sun.misc.Launcher$AppClassLoader.loadClass(Launcher.java:301)
	at java.lang.ClassLoader.loadClass(ClassLoader.java:252)
	at java.lang.ClassLoader.loadClassInternal(ClassLoader.java:320)


FAILED:  <init>.org.apache.hadoop.security.TestPermission

Error Message:
org/apache/hadoop/conf/Configuration

Stack Trace:
java.lang.NoClassDefFoundError: org/apache/hadoop/conf/Configuration
	at java.lang.Class.forName0(Native Method)
	at java.lang.Class.forName(Class.java:169)
Caused by: java.lang.ClassNotFoundException: org.apache.hadoop.conf.Configuration
	at java.net.URLClassLoader$1.run(URLClassLoader.java:200)
	at java.security.AccessController.doPrivileged(Native Method)
	at java.net.URLClassLoader.findClass(URLClassLoader.java:188)
	at java.lang.ClassLoader.loadClass(ClassLoader.java:307)
	at sun.misc.Launcher$AppClassLoader.loadClass(Launcher.java:301)
	at java.lang.ClassLoader.loadClass(ClassLoader.java:252)
	at java.lang.ClassLoader.loadClassInternal(ClassLoader.java:320)


FAILED:  <init>.org.apache.hadoop.security.TestGroupMappingServiceRefresh

Error Message:
org/apache/hadoop/conf/Configuration

Stack Trace:
java.lang.NoClassDefFoundError: org/apache/hadoop/conf/Configuration
	at java.lang.Class.forName0(Native Method)
	at java.lang.Class.forName(Class.java:169)
Caused by: java.lang.ClassNotFoundException: org.apache.hadoop.conf.Configuration
	at java.net.URLClassLoader$1.run(URLClassLoader.java:200)
	at java.security.AccessController.doPrivileged(Native Method)
	at java.net.URLClassLoader.findClass(URLClassLoader.java:188)
	at java.lang.ClassLoader.loadClass(ClassLoader.java:307)
	at sun.misc.Launcher$AppClassLoader.loadClass(Launcher.java:301)
	at java.lang.ClassLoader.loadClass(ClassLoader.java:252)
	at java.lang.ClassLoader.loadClassInternal(ClassLoader.java:320)


FAILED:  org.apache.hadoop.tools.TestDelegationTokenFetcher.initializationError

Error Message:
org/apache/hadoop/fs/FileSystem

Stack Trace:
java.lang.NoClassDefFoundError: org/apache/hadoop/fs/FileSystem
	at java.lang.ClassLoader.defineClass1(Native Method)
	at java.lang.ClassLoader.defineClass(ClassLoader.java:621)
	at java.security.SecureClassLoader.defineClass(SecureClassLoader.java:124)
	at java.net.URLClassLoader.defineClass(URLClassLoader.java:260)
	at java.net.URLClassLoader.access$000(URLClassLoader.java:56)
	at java.net.URLClassLoader$1.run(URLClassLoader.java:195)
	at java.security.AccessController.doPrivileged(Native Method)
	at java.net.URLClassLoader.findClass(URLClassLoader.java:188)
	at java.lang.ClassLoader.loadClass(ClassLoader.java:307)
	at sun.misc.Launcher$AppClassLoader.loadClass(Launcher.java:301)
	at java.lang.ClassLoader.loadClass(ClassLoader.java:252)
	at java.lang.ClassLoader.loadClassInternal(ClassLoader.java:320)
	at java.lang.Class.getDeclaredFields0(Native Method)
	at java.lang.Class.privateGetDeclaredFields(Class.java:2291)
	at java.lang.Class.getDeclaredFields(Class.java:1743)
	at java.lang.reflect.Constructor.newInstance(Constructor.java:513)
Caused by: java.lang.ClassNotFoundException: org.apache.hadoop.fs.FileSystem
	at java.net.URLClassLoader$1.run(URLClassLoader.java:200)
	at java.security.AccessController.doPrivileged(Native Method)
	at java.net.URLClassLoader.findClass(URLClassLoader.java:188)
	at java.lang.ClassLoader.loadClass(ClassLoader.java:307)
	at sun.misc.Launcher$AppClassLoader.loadClass(Launcher.java:301)
	at java.lang.ClassLoader.loadClass(ClassLoader.java:252)
	at java.lang.ClassLoader.loadClassInternal(ClassLoader.java:320)


FAILED:  <init>.org.apache.hadoop.tools.TestJMXGet

Error Message:
org/apache/hadoop/conf/Configuration

Stack Trace:
java.lang.NoClassDefFoundError: org/apache/hadoop/conf/Configuration
	at java.lang.Class.forName0(Native Method)
	at java.lang.Class.forName(Class.java:169)
Caused by: java.lang.ClassNotFoundException: org.apache.hadoop.conf.Configuration
	at java.net.URLClassLoader$1.run(URLClassLoader.java:200)
	at java.security.AccessController.doPrivileged(Native Method)
	at java.net.URLClassLoader.findClass(URLClassLoader.java:188)
	at java.lang.ClassLoader.loadClass(ClassLoader.java:307)
	at sun.misc.Launcher$AppClassLoader.loadClass(Launcher.java:301)
	at java.lang.ClassLoader.loadClass(ClassLoader.java:252)
	at java.lang.ClassLoader.loadClassInternal(ClassLoader.java:320)




Mime
View raw message