hadoop-common-issues mailing list archives

Site index · List index
Message view « Date » · « Thread »
Top « Date » · « Thread »
From "Steve Loughran (JIRA)" <j...@apache.org>
Subject [jira] [Commented] (HADOOP-14696) parallel tests don't work for Windows
Date Fri, 04 Aug 2017 21:18:00 GMT

    [ https://issues.apache.org/jira/browse/HADOOP-14696?page=com.atlassian.jira.plugin.system.issuetabpanels:comment-tabpanel&focusedCommentId=16114980#comment-16114980
] 

Steve Loughran commented on HADOOP-14696:
-----------------------------------------

-1, aws test runs fail to start on macos &  java 1.8.0_121. I suspect one of the properties
isn't resolving

you could probably test that yourself just by running {{mvn verify}} in the directory.

{code}
[INFO] ------------------------------------------------------------------------
[INFO] BUILD FAILURE
[INFO] ------------------------------------------------------------------------
[INFO] Total time: 7.414 s (Wall Clock)
[INFO] Finished at: 2017-08-04T22:07:18+01:00
[INFO] Final Memory: 57M/810M
[INFO] ------------------------------------------------------------------------
[ERROR] Failed to execute goal org.apache.maven.plugins:maven-antrun-plugin:1.7:run (create-parallel-tests-dirs)
on project hadoop-aws: An Ant BuildException has occured: java.lang.RuntimeException: java.lang.NoSuchMethodException:
Can't unambiguously select between fixed arity signatures [(java.lang.String, java.lang.String),
(java.io.File, java.lang.String)] of the method java.io.File.<init> for argument types
[null, java.lang.Integer]
[ERROR] around Ant part ...<script language="javascript">var baseDirs = [... @ 4:33
in /Users/stevel/Projects/hadoop-trunk/hadoop-tools/hadoop-aws/target/antrun/build-main.xml
[ERROR] -> [Help 1]
[ERROR] 
[ERROR] To see the full stack trace of the errors, re-run Maven with the -e switch.
[ERROR] Re-run Maven using the -X switch to enable full debug logging.
[ERROR] 
[ERROR] For more information about the errors and possible solutions, please read the following
articles:
[ERROR] [Help 1] http://cwiki.apache.org/confluence/display/MAVEN/MojoExecutionException
{code}


> parallel tests don't work for Windows
> -------------------------------------
>
>                 Key: HADOOP-14696
>                 URL: https://issues.apache.org/jira/browse/HADOOP-14696
>             Project: Hadoop Common
>          Issue Type: Test
>          Components: test
>    Affects Versions: 3.0.0-beta1
>         Environment: Windows
>            Reporter: Allen Wittenauer
>            Assignee: Allen Wittenauer
>            Priority: Minor
>         Attachments: HADOOP-14696.00.patch, HADOOP-14696.01.patch
>
>
> If hadoop-common-project/hadoop-common is run with the -Pparallel-tests flag, it fails
in create-parallel-tests-dirs from the pom.xml
> {code}
> [ERROR] Failed to execute goal org.apache.maven.plugins:maven-antrun-plugin:1.7:run (create-parallel-tests-dirs)
on project hadoop-common: An Ant BuildException has occured: Directory F:\jenkins\jenkins-slave\workspace\hadoop-trunk-win\s\hadoop-common-project\hadoop-common\jenkinsjenkins-slaveworkspacehadoop-trunk-winshadoop-common-projecthadoop-common
arget\test\data\1 creation was not successful for an unknown reason
> [ERROR] around Ant part ...<script language="javascript">var baseDirs = [... @
4:33 in F:\jenkins\jenkins-slave\workspace\hadoop-trunk-win\s\hadoop-common-project\hadoop-common\target\antrun\build-main.xml
> {code}



--
This message was sent by Atlassian JIRA
(v6.4.14#64029)

---------------------------------------------------------------------
To unsubscribe, e-mail: common-issues-unsubscribe@hadoop.apache.org
For additional commands, e-mail: common-issues-help@hadoop.apache.org


Mime
View raw message